program: Gaussian 09
title: 000291866
version: EM64L-G09RevD.01
frameworkgroup: C1[X(C12H9NO2)]
method: RPBEPBE
basis: SDD
operation: Freq
keyword: #p
keyword: freq=noraman
keyword: PBEPBE/SDD
title: #p freq=noraman PBEPBE/SDD
converged: YES YES NO NO
title: Mulliken charges:
elementType: O O N C C C C C C C C C C C C H H H H H H H H H
charge: -0.410091 -0.251113 -0.025384 0.475424 -0.372676 -0.380016 -0.285579 -0.232410 -0.233165 -0.228358 -0.190101 -0.250653 0.154172 0.119209 -0.212318 0.236788 0.234789 0.229790 0.236329 0.235815 0.237850 0.252820 0.271683 0.387194
chargesum: 0.00000
title: Mulliken charges with hydrogens summed into heavy atoms:
elementType: O O N C C C C C C C C C C C C
charge: -0.022897 -0.251113 -0.025384 0.475424 -0.135888 -0.145226 -0.055789 0.003920 0.002649 0.009492 0.062719 0.021030 0.154172 0.119209 -0.212318
polarizability: 3.60499051e+02 -1.32117911e+01 1.53478216e+02 2.61634898e-02 7.34193941e-02 5.44258933e+01
1716.lowfreq: -0.0007 -0.0006 -0.0004 5.1258 7.1165 13.0457 39.7297 48.8308 52.8427
frequency: 39.5196 48.7469 52.8136 74.1632 133.3003 136.7620 151.5158 239.0026 250.4358 258.4034 324.3398 357.5599 402.1092 428.4123 466.6122 498.3071 515.1727 548.4924 603.3528 614.3694 617.7553 635.0009 691.4222 730.7251 763.9553 772.2930 846.6755 857.5433 896.3557 934.4130 953.4319 983.7350 987.5131 1001.4033 1013.1577 1014.8141 1025.8070 1086.3736 1115.1500 1176.5382 1191.5356 1195.8645 1244.1380 1278.7184 1304.1275 1321.8188 1340.4053 1354.8471 1392.1838 1442.4371 1482.8236 1566.8779 1579.5609 1602.7929 1613.6554 1641.1674 2166.1054 3087.6670 3112.6606 3124.3924 3127.1585 3134.9292 3145.4141 3156.7120 3171.0124 3532.2202
redmass: 4.5062 5.9131 6.9479 9.4636 8.8900 4.9123 6.9270 2.1111 7.2349 4.9251 5.6413 3.8368 2.7726 6.9934 6.4228 2.9598 8.4760 2.1162 5.4342 6.4403 1.8393 4.5211 1.6947 7.9795 6.4339 1.7184 1.2798 4.5922 1.5821 1.5532 1.4335 1.3949 6.1516 1.3096 1.1973 4.9107 2.2080 1.6462 1.9728 1.0767 1.4070 1.3742 2.1332 1.5393 1.5369 1.9500 2.0364 1.8663 5.9664 2.3475 2.2655 6.7430 5.3604 5.5907 6.3326 6.7112 12.6219 1.0904 1.0919 1.0881 1.0885 1.0864 1.0913 1.0963 1.1016 1.0642
irintensity: 0.2436 0.7952 0.9156 2.5867 1.4021 0.9467 0.8918 0.3692 0.6723 0.5248 2.4510 0.0477 0.0062 25.1835 25.1108 27.6419 10.2894 32.8587 1.3155 0.4249 109.0340 66.3392 48.9725 21.3222 1.0728 58.8739 0.0002 10.5084 0.1972 0.0144 5.2262 0.0036 6.9457 14.1740 55.0314 314.0968 24.7068 15.0281 344.5060 1.7108 54.1759 11.1682 0.9965 0.7818 20.5853 201.3425 64.9242 5.2451 1.0876 12.6816 0.5419 282.4481 170.5817 257.5576 115.0836 164.6265 26.2160 9.7126 0.7370 3.6229 11.6364 0.8135 5.2511 28.1561 32.5300 84.6385
temp: 298.150 k
press: 1.00000 atm
elementType: 8 8 7 6 6 6 6 6 6 6 6 6 6 6 6 1 1 1 1 1 1 1 1 1
symmnumber: 1
zpe: 463903.9 jmol-1
zpe.correction: 0.176692 hartree
zpe.thermalcorrener: 0.190182 hartree
zpe.thermalcorrenthalpy: 0.191126 hartree
zpe.thermalcorrgfe: 0.134834 hartree
zpe.sumelectzpe: -666.810032 hartree
zpe.sumelectthermal: -666.796542 hartree
zpe.sumelectthermalent: -666.795598 hartree
zpe.sumelectthermalfe: -666.851890 hartree
dipole: 4.7140 -2.4671 0.0087
dipole: 5.3206
quadrupole: -67.6371 -94.7455 -90.8824
quadrupole: 5.5374 -0.0225 0.0721
quadrupole: 16.7845 -10.3238 -6.4607 5.5374 -0.0225 0.0721
hfenergy: -666.9867239 hartree
pointgroup: C01 [X(C12H9N1O2)]
dipole: 1.869446 -0.9362163 0.1022484 debye
dipolederiv: -1.5660256 0.3886844 -0.0436729 0.5550075 -0.4398657 0.0061362 -0.057521 0.0046028 -0.4135059 -0.8871307 -0.1861194 0.0128035 -0.6096605 -1.0412086 0.058941 0.0518868 0.0632248 -0.3389391 -0.1849921 -0.0142199 0.0018094 0.2160849 -0.3704775 0.0126278 -0.0190441 0.0108251 -0.2516833 -0.5264728 -0.0614561 0.0004286 -0.2133055 -0.076895 0.0078868 0.0131016 0.009307 0.0348043 0.0421545 -0.0658683 0.0071455 0.2469018 -0.0160776 -0.0073885 -0.0195975 -0.0101457 -0.1268523 0.1563257 0.1248982 -0.007974 -0.2080295 0.0943362 -0.0235284 0.0214078 -0.0208264 -0.1567091 1.340537 0.0791682 0.0052362 -0.0855952 0.2146696 -0.0277549 0.0201542 -0.0265492 -0.095052 -0.3101613 0.0784266 -0.0081115 0.22914 0.1361911 -0.0218182 -0.0210772 -0.0232051 -0.1387235 -0.0204733 -0.1667723 0.0154969 -0.36329 -0.0267503 -0.0129494 0.0321681 -0.0112624 -0.1397111 0.039634 0.0473155 -0.0022393 -0.015239 0.0159271 -0.0136102 0.003015 -0.0130469 -0.1409649 -1.4397802 -0.0236458 -0.008712 0.1579386 0.024074 -0.014726 -0.0226256 -0.0163357 -0.15871 1.6905915 -0.1093534 0.0240007 -0.0057439 0.0119297 -0.0040644 0.0144353 -0.0050523 -0.0364871 -1.7444205 -0.0540443 -0.0089914 -0.0041904 -0.0996913 0.0109356 -0.0118063 0.0102702 0.0189942 2.8485047 0.050372 0.0143023 0.7293134 1.2814346 -0.0871044 -0.0488059 -0.0930278 0.2579538 -0.0356146 -0.0408158 0.0029854 -0.3250046 0.3155466 -0.0259651 0.0282534 -0.0235238 0.0617867 0.01777 0.097813 -0.0095496 0.0717121 0.0209734 0.0113741 -0.0074576 0.0116127 0.1450845 0.0895518 -0.0780049 0.0061288 -0.0291593 -0.0775172 0.019708 0.001886 0.0194622 0.1535061 0.0475666 -0.0153836 0.0006194 -0.0682821 -0.0815215 0.0192005 0.0048821 0.0196961 0.1447848 0.0517765 -0.034589 0.0019869 -0.0899831 -0.08806 0.0204708 0.0067671 0.0210153 0.1578317 -0.056113 0.0956348 -0.0101746 0.1252374 -0.0025941 0.0151999 -0.0128355 0.0149458 0.1601514 -0.1096564 -0.0526917 0.0019959 -0.0618876 0.0783219 0.0065053 0.0028348 0.0065787 0.1604749 0.0574738 -0.0146407 0.0004918 -0.0674564 -0.0427912 0.0174051 0.0045482 0.017863 0.1609406 0.1020869 0.0321932 -0.0031859 -0.0231944 0.0041835 0.0119171 0.0007719 0.012411 0.1391286 0.3968672 -0.0769007 0.0071799 -0.1613141 0.1658623 0.0206013 0.0146582 0.0211605 0.4018966 unknown
polarizability: 360.839585|-9.7150591|152.3378323|3.4102901|-8.7319066|55.2257427 unknown
InChI: InChI=1S/C12H9NO2/c13-9-11(12(14)15)8-4-7-10-5-2-1-3-6-10/h1-8,14H
charge 0 multiplicity 1
24 atoms
O  -5.118839 0.065275 -0.068333
O  -4.076828 -2.008478 0.126016
N  -2.767098 2.637325 -0.287482
C  2.31326 -0.370274 0.026445
C  2.661066 1.010603 -0.088991
C  3.366892 -1.328732 0.118044
C  0.930787 -0.845956 0.056308
C  4.010068 1.408879 -0.110631
C  4.717213 -0.928014 0.096121
C  5.044371 0.443604 -0.018243
C  -0.217605 -0.080671 -0.019806
C  -1.525541 -0.673489 0.022349
C  -2.730237 0.017946 -0.048805
C  -3.994237 -0.760014 0.012993
C  -2.774376 1.444852 -0.178624
H  1.876393 1.771135 -0.161229
H  3.114639 -2.392617 0.207345
H  0.805399 -1.935857 0.149997
H  4.262321 2.470986 -0.199557
H  5.512029 -1.677948 0.167811
H  6.092988 0.75987 -0.03547
H  -0.157261 1.010797 -0.114962
H  -1.606721 -1.76568 0.119367
H  -5.940379 -0.493938 -0.022063
