program: Gaussian 09
title: 000291951
version: EM64L-G09RevD.01
frameworkgroup: C1[X(C19H25Cl2N7)]
method: RPBEPBE
basis: SDD
operation: Freq
keyword: #p
keyword: freq=noraman
keyword: PBEPBE/SDD
title: #p freq=noraman PBEPBE/SDD
converged: YES YES NO NO
title: Mulliken charges:
elementType: Cl Cl N N N N N N N C C C C C C C C C C C C C C C C C C C H H H H H H H H H H H H H H H H H H H H H H H H H
charge: -0.065769 -0.060390 -0.044997 -0.362807 -0.038954 -0.260640 -0.127865 -0.472995 -0.673910 -0.117961 -0.505690 -0.491218 -0.418595 -0.415062 -0.299534 -0.679897 0.197386 -0.459956 0.300102 -0.088418 -0.779338 0.242293 0.489066 -0.261597 -0.470170 -0.021943 -0.070046 -0.292906 0.232956 0.217524 0.228670 0.229154 0.230423 0.219538 0.220001 0.220697 0.232704 0.173793 0.214243 0.326491 0.208789 0.232350 0.205209 0.242048 0.241079 0.240890 0.226031 0.297938 0.378055 0.246244 0.287538 0.418676 0.280767
chargesum: 0.00000
title: Mulliken charges with hydrogens summed into heavy atoms:
elementType: Cl Cl N N N N N N N C C C C C C C C C C C C C C C C C C C
charge: -0.065769 -0.060390 -0.044997 -0.036316 -0.038954 -0.260640 -0.127865 -0.175057 0.032304 0.114996 -0.059496 -0.031641 0.020945 0.038340 0.088503 -0.033549 0.197386 -0.217908 0.300102 -0.088418 -0.071338 0.242293 0.489066 0.116458 -0.223925 -0.021943 -0.070046 -0.012139
polarizability: 4.51791820e+02 -5.25744049e+00 3.15768434e+02 2.52434765e+01 2.03974162e+01 1.63575174e+02
1716.lowfreq: -6.4450 -2.2683 0.0013 0.0019 0.0022 2.6659 6.6342 12.2430 18.1362
frequency: 5.3417 12.1411 18.1197 29.4837 32.4406 43.4897 65.5734 72.1080 74.7697 77.4980 97.2829 124.6607 139.4943 140.0536 148.4662 153.6393 187.2546 190.7085 195.2563 204.6679 221.8902 224.8486 234.7071 241.4222 281.7234 282.3497 328.8600 341.6242 345.4482 360.8411 382.9824 386.3449 396.5148 411.1194 418.8335 425.5024 512.9555 526.1531 531.2980 534.3239 550.2745 557.7505 585.7399 591.6105 595.0916 641.6567 650.6312 669.0153 673.1829 675.8679 696.7899 741.7675 756.6214 770.7815 771.5097 796.5155 808.8419 823.2615 836.9313 846.5412 852.4687 868.2883 909.6254 912.1248 917.5981 944.2249 949.1173 956.8874 973.7520 974.2673 974.4830 989.9808 1017.1402 1021.3262 1048.1270 1051.9567 1065.8803 1068.4968 1085.8291 1089.2373 1093.7765 1102.9830 1106.0069 1118.0265 1134.4180 1175.8759 1177.3992 1194.0631 1202.9388 1227.3465 1239.1088 1258.8264 1266.1123 1273.5176 1280.9195 1287.4319 1293.8567 1299.1146 1321.0485 1322.2717 1330.7251 1337.9005 1353.4533 1359.8702 1380.3187 1388.7241 1392.1582 1397.1889 1412.7501 1424.0178 1451.1821 1457.5429 1460.4408 1461.3957 1467.1809 1469.3640 1471.6069 1480.5495 1486.1875 1487.2715 1489.7882 1511.6571 1520.3937 1535.1821 1577.6041 1590.5322 1607.1119 1652.0653 2852.0761 2930.0001 2934.3203 2970.5339 2982.3437 2982.7927 2987.7224 2987.9056 2991.1880 2999.6196 3026.0685 3063.2168 3065.7213 3072.5352 3074.5380 3082.9412 3094.7805 3101.1523 3144.2705 3158.2152 3175.3850 3193.3272 3537.5156 3544.8887 3590.4722
redmass: 4.7541 5.5311 7.3092 5.8207 5.0545 4.1005 3.9746 2.3680 1.2783 2.3972 5.1840 2.8388 4.3497 3.5969 7.3055 5.9491 3.3639 5.1205 3.6986 4.8645 3.7014 1.3124 4.8089 3.2178 5.5976 2.4544 4.7997 3.7252 1.5089 2.3721 4.8078 5.3240 2.7726 7.8585 2.8145 2.7348 4.5451 1.1765 5.4913 4.3505 2.1002 6.0322 1.9752 3.2246 2.7360 4.3161 5.6205 3.6607 4.0163 3.1786 4.4188 9.0656 2.8993 8.2050 4.3603 1.1977 2.8731 1.7371 1.4059 1.6133 1.8706 5.5978 1.9321 3.7639 2.3748 3.6892 2.4003 1.2999 1.9657 4.1767 1.1140 3.9883 1.8863 2.5154 1.5934 2.4966 2.7024 2.7475 1.7084 1.9246 2.1695 1.7645 1.6111 1.7697 2.5984 1.8446 1.4796 1.9216 1.3245 1.1878 1.3178 2.9765 1.3938 1.3396 3.8886 1.1837 1.7182 1.3099 1.5595 1.2463 1.8431 2.1354 1.5444 1.3750 4.8792 1.2315 1.5388 2.1607 3.4282 3.7528 2.9144 1.0464 1.0599 1.3477 1.0825 1.0825 1.0642 1.0807 1.6354 1.1017 1.1370 2.6669 3.2621 3.9162 4.1046 3.4974 6.5641 2.8869 1.0706 1.0739 1.0587 1.0889 1.0649 1.0485 1.0403 1.0660 1.0623 1.0857 1.0885 1.1005 1.0981 1.0975 1.0988 1.0999 1.1002 1.0998 1.0926 1.0946 1.0927 1.0939 1.0764 1.0757 1.0838
irintensity: 0.0961 0.2531 0.0147 0.1235 0.1575 3.4077 8.3104 0.4275 0.6080 1.1121 5.4831 2.9989 1.0850 1.0125 0.1161 0.0777 1.6126 3.2003 1.2348 0.0056 0.8406 0.0273 1.2539 0.2464 11.6137 1.8210 0.2553 16.5061 35.9992 8.4743 4.0812 0.0805 4.6231 12.1796 1.7366 2.2738 6.2762 76.6006 4.6810 5.4858 65.0064 10.3628 131.5654 1.5429 1.0418 4.3580 12.7961 7.3647 29.6067 2.9745 1.4866 39.9966 6.5036 30.4864 0.0871 6.4242 12.9599 24.4595 19.7535 47.6476 5.9687 14.1171 5.9881 1.8435 1.7535 52.7466 21.9902 17.4727 7.5373 24.1188 97.3034 31.4781 7.3088 0.8043 16.6865 20.6147 28.2078 116.2683 4.6184 8.7730 21.6355 1.9801 6.1333 5.9209 2.6250 3.4250 1.6721 12.9020 17.1304 6.4142 27.5172 40.2860 5.1148 4.3935 18.8052 9.5491 9.3297 0.9397 20.2875 4.1291 61.4394 43.4081 33.9859 10.0250 456.4807 17.0805 72.0255 87.6643 797.7095 34.7087 173.0953 14.1803 4.1539 361.2903 2.5449 24.6930 13.3248 6.3070 654.7107 62.9015 111.3942 246.5345 387.3369 63.5968 1234.3346 324.8141 249.9551 418.1256 95.2829 764.6743 3.7191 3.0035 36.2025 34.8785 31.3056 41.0080 40.7274 74.4328 12.8523 20.0596 41.4406 13.2989 74.2936 29.7142 36.2539 18.8787 4.0842 96.7073 9.3564 2.1637 38.5977 20.0078 36.1152
temp: 298.150 k
press: 1.00000 atm
elementType: 17 17 7 7 7 7 7 7 7 6 6 6 6 6 6 6 6 6 6 6 6 6 6 6 6 6 6 6 1 1 1 1 1 1 1 1 1 1 1 1 1 1 1 1 1 1 1 1 1 1 1 1 1
symmnumber: 1
zpe: 1112444.0 jmol-1
zpe.correction: 0.423708 hartree
zpe.thermalcorrener: 0.452093 hartree
zpe.thermalcorrenthalpy: 0.453037 hartree
zpe.thermalcorrgfe: 0.359051 hartree
zpe.sumelectzpe: -2040.337575 hartree
zpe.sumelectthermal: -2040.309189 hartree
zpe.sumelectthermalent: -2040.308245 hartree
zpe.sumelectthermalfe: -2040.402231 hartree
dipole: -4.0870 5.9859 -0.2602
dipole: 7.2527
quadrupole: -165.3024 -164.5146 -183.4020
quadrupole: 14.0720 10.8632 7.1777
quadrupole: 5.7706 6.5584 -12.3290 14.0720 10.8632 7.1777
hfenergy: -2040.7612821 hartree
pointgroup: C01 [X(C19H25Cl2N7)]
dipole: 1.4580263 -2.3045923 0.8396782 debye
polarizability: 446.9780107|-30.2005413|278.0092681|-32.2778156|-68.0471605|206.1481495 unknown
InChI: InChI=1S/C19H25Cl2N7/c1-3-28-5-4-13(11-28)10-23-17-6-12(2)24-19(26-17)27-18(22)25-16-8-14(20)7-15(21)9-16/h6-9,13,23,25H,3-5,10-11,22H2,1-2H3
charge 0 multiplicity 1
53 atoms
Cl -8.126446 2.309647 0.10876
Cl -3.049808 3.489549 -1.814445
N  6.278103 2.046884 -0.370099
N  2.639093 -0.291233 -0.785092
N  0.446135 -0.584319 -0.084244
N  -0.214126 -2.49464 1.279801
N  -1.777488 -0.785095 0.573978
N  -4.078533 -0.777986 1.116528
N  -2.732488 -2.54014 1.907269
C  4.802262 0.538989 -1.676337
C  6.301039 0.179301 -1.936507
C  4.876897 1.884802 -0.851043
C  7.087251 1.447241 -1.468305
C  4.065242 -0.599901 -0.940299
C  6.554564 1.477054 0.979451
C  7.857384 2.037143 1.579676
C  1.73184 -1.057987 -0.091857
C  2.096107 -2.270197 0.581341
C  1.077132 -2.958717 1.260497
C  -0.491107 -1.309888 0.597746
C  1.340123 -4.247297 2.007503
C  -2.807645 -1.368532 1.186807
C  -4.498506 0.407031 0.46584
C  -3.622619 1.251442 -0.271259
C  -5.880078 0.738763 0.578327
C  -6.353849 1.901803 -0.045806
C  -4.165706 2.399056 -0.86874
C  -5.52445 2.766696 -0.784549
H  4.281464 0.719408 -2.638243
H  6.595033 -0.697995 -1.328149
H  6.497644 -0.070456 -2.993608
H  4.168015 1.90771 -0.004524
H  4.633958 2.734991 -1.517605
H  7.153954 2.175596 -2.299834
H  8.113744 1.225581 -1.132624
H  4.530206 -0.748854 0.057246
H  4.193609 -1.548819 -1.504698
H  6.600071 0.358163 0.980333
H  5.708852 1.761576 1.632854
H  2.246356 0.536035 -1.240737
H  8.738586 1.762877 0.97099
H  7.80716 3.138544 1.626662
H  8.017337 1.641744 2.600208
H  3.117425 -2.65518 0.570916
H  0.720337 -5.064171 1.59508
H  1.067127 -4.136402 3.07273
H  2.400325 -4.54287 1.944333
H  -4.820352 -1.277874 1.609369
H  -2.567607 0.976062 -0.343811
H  -6.568945 0.100327 1.141805
H  -3.532652 -2.971806 2.366523
H  -1.748642 -2.928777 1.918714
H  -5.911029 3.66832 -1.263074
