program: Gaussian 09
title: 000291864
version: EM64L-G09RevD.01
frameworkgroup: C1[X(C10H14BrNO)]
method: RPBEPBE
basis: SDD
operation: Freq
keyword: #p
keyword: freq=noraman
keyword: PBEPBE/SDD
title: #p freq=noraman PBEPBE/SDD
converged: YES YES NO NO
title: Mulliken charges:
elementType: Br O N C C C C C C C C C C H H H H H H H H H H H H H H
charge: -0.034221 -0.429073 -0.168985 -0.441310 -0.391532 0.451181 -0.323211 -0.669183 -0.362474 -0.358524 -0.238895 -0.239588 -0.265972 0.215381 0.245262 0.254441 0.246658 0.247797 0.195331 0.281501 0.308554 0.235549 0.229737 0.223010 0.222957 0.228742 0.336868
chargesum: 0.00000
title: Mulliken charges with hydrogens summed into heavy atoms:
elementType: Br O N C C C C C C C C C C
charge: -0.034221 -0.092205 -0.168985 0.019333 0.109566 0.451181 0.119917 -0.079128 -0.126924 -0.128787 -0.015886 -0.016631 -0.037230
polarizability: 1.90796277e+02 1.48399316e+01 1.49030169e+02 -1.43152505e+01 9.23103359e+00 7.74821294e+01
1716.lowfreq: 0.0001 0.0004 0.0005 2.5305 5.4798 6.3282 31.3435 49.0646 53.5342
frequency: 31.3164 49.0572 53.5280 65.9856 112.7013 135.8140 175.1623 190.7400 217.4483 272.7948 299.9757 315.6478 362.9410 389.5465 420.7664 506.5691 517.3749 563.3502 614.3604 630.8324 695.5017 743.7132 754.2433 768.0025 807.3166 815.2517 873.7886 948.3393 958.6031 961.7522 976.4295 978.4927 990.0355 1023.4187 1028.8843 1034.0070 1061.9987 1095.0392 1121.2076 1174.5263 1180.4378 1206.0422 1224.7290 1225.3851 1276.1034 1288.6219 1304.8900 1334.6293 1344.6683 1351.1359 1379.2469 1380.9043 1390.9714 1448.6124 1454.3343 1473.2162 1483.1050 1495.5931 1503.6900 1580.2444 1618.9190 2968.6074 2988.3418 3012.2519 3050.2934 3061.0452 3068.3582 3097.6499 3124.8909 3131.0906 3148.0491 3151.9599 3158.6044 3170.8860 3563.9584
redmass: 6.8758 4.8013 5.6877 4.0496 2.1823 2.3880 6.7457 4.0957 3.9749 1.9030 1.9876 2.5819 4.8613 2.6456 2.9738 3.2260 3.7229 3.9020 6.2958 4.8018 1.8306 3.7495 1.8630 1.1721 1.1550 1.2446 1.4570 2.3289 1.5429 2.9501 4.4430 1.3189 1.7938 4.1758 3.8769 2.3530 1.5118 1.7381 1.3621 1.0640 1.6525 1.1201 1.3079 1.8466 1.3860 1.2191 1.1699 1.3504 1.3659 1.2786 1.9342 3.0184 1.4637 2.0288 1.2054 1.0923 1.0971 1.8051 1.2986 5.9832 6.0518 1.0693 1.0627 1.0605 1.0987 1.0587 1.1020 1.0969 1.0846 1.0884 1.1107 1.0927 1.0940 1.1004 1.0665
irintensity: 1.5654 1.2931 0.2581 0.9854 4.5201 3.5863 3.2007 4.8789 1.0982 32.2544 31.3825 126.3439 7.1619 2.3987 0.5767 22.3737 21.7485 8.1264 3.5886 64.5976 37.2107 12.4103 86.0565 9.6343 7.9193 0.2586 5.7088 25.1590 24.4447 80.7412 5.8129 0.5221 5.4674 15.4022 4.1394 17.9068 2.3562 0.5251 77.2013 0.5384 42.9533 10.2618 12.7052 43.0414 43.7346 14.8977 0.9379 6.9536 47.9997 18.4725 23.2104 7.2811 12.3006 3.9021 10.5587 4.4304 20.6795 102.1404 91.2826 10.3667 180.2459 42.1308 46.0498 22.7830 16.1800 14.4446 11.5312 24.0842 8.9884 6.7567 9.7779 32.2757 37.2068 6.5222 8.7480
temp: 298.150 k
press: 1.00000 atm
elementType: 35 8 7 6 6 6 6 6 6 6 6 6 6 1 1 1 1 1 1 1 1 1 1 1 1 1 1
symmnumber: 1
zpe: 582449.4 jmol-1
zpe.correction: 0.221843 hartree
zpe.thermalcorrener: 0.235483 hartree
zpe.thermalcorrenthalpy: 0.236428 hartree
zpe.thermalcorrgfe: 0.178871 hartree
zpe.sumelectzpe: -531.882305 hartree
zpe.sumelectthermal: -531.868665 hartree
zpe.sumelectthermalent: -531.867721 hartree
zpe.sumelectthermalfe: -531.925278 hartree
dipole: 0.1824 1.2029 0.3498
dipole: 1.2659
quadrupole: -101.6871 -83.1056 -89.8214
quadrupole: 8.7997 -1.8183 2.4266
quadrupole: -10.1491 8.4324 1.7167 8.7997 -1.8183 2.4266
hfenergy: -532.1041484 hartree
pointgroup: C01 [X(C10H14Br1N1O1)]
dipole: 0.3800713 0.2861635 0.1473337 debye
polarizability: 185.3535839|-20.6492641|153.9380545|-2.8833149|17.726891|78.0169361 unknown
InChI: InChI=1S/C10H14BrNO/c11-6-7-12(8-9-13)10-4-2-1-3-5-10/h1-5,13H,6-9H2
charge 0 multiplicity 1
27 atoms
Br 3.166712 -3.455064 -0.026699
O  1.991792 3.709605 0.001556
N  0.769232 0.104711 0.036533
C  1.387041 1.347301 0.529803
C  1.670503 -0.949913 -0.451241
C  -0.636629 -0.055435 0.003571
C  1.465171 2.45514 -0.553031
C  1.937587 -1.98358 0.660619
C  -1.510173 1.001424 0.407487
C  -1.233817 -1.278931 -0.432809
C  -2.909404 0.833594 0.375949
C  -2.635202 -1.427564 -0.465677
C  -3.490959 -0.378186 -0.060822
H  2.41009 1.11425 0.885507
H  0.83726 1.740723 1.404033
H  1.252302 -1.448516 -1.343546
H  2.627405 -0.496524 -0.765442
H  0.456631 2.70875 -0.9155
H  2.067492 2.103303 -1.417327
H  2.463806 -1.546079 1.522689
H  1.022241 -2.496882 0.989185
H  -1.108325 1.962742 0.740537
H  -0.614831 -2.125295 -0.746131
H  -3.548949 1.665923 0.692004
H  -3.05833 -2.379549 -0.806856
H  -4.578327 -0.501161 -0.085127
H  2.951779 3.599312 0.218537
