program: Gaussian 09
title: 000291930
version: EM64L-G09RevD.01
frameworkgroup: C1[X(C23H20N2)]
method: RPBEPBE
basis: SDD
operation: Freq
keyword: #pfreq=noraman
keyword: PBEPBE/SDD
title: #p freq=noraman PBEPBE/SDD
converged: YES YES NO NO
title: Mulliken charges:
elementType: N N C C C C C C C C C C C C C C C C C C C C C C C H H H H H H H H H H H H H H H H H H H H
charge: -0.092966 -0.107045 -0.445502 -0.553154 -0.546243 0.310020 0.295759 -0.565478 -0.430370 0.462299 -0.399836 -0.390566 -0.038769 0.344892 0.302264 -0.380942 -0.371613 -0.346298 -0.376331 -0.233089 -0.236023 -0.249757 -0.230584 -0.237789 -0.240809 0.225617 0.218128 0.225523 0.231822 0.229258 0.226378 0.285947 0.240801 0.228238 0.241880 0.260377 0.257003 0.246723 0.270383 0.228511 0.227142 0.228625 0.227052 0.229481 0.229042
chargesum: 0.00000
title: Mulliken charges with hydrogens summed into heavy atoms:
elementType: N N C C C C C C C C C C C C C C C C C C C C C C C
charge: -0.092966 -0.107045 -0.001758 -0.095809 -0.090607 0.310020 0.295759 -0.279530 -0.189569 0.462299 -0.171598 -0.148686 -0.038769 0.344892 0.302264 -0.120565 -0.114609 -0.099575 -0.105948 -0.004578 -0.008882 -0.021133 -0.003532 -0.008308 -0.011768
polarizability: 5.15966135e+02 -4.54579880e+00 2.87275479e+02 -2.15896734e+01 4.47266786e+00 1.50743974e+02
1716.lowfreq: -8.8874 -2.2035 -0.0006 0.0002 0.0010 3.3439 8.3374 24.8192 28.2094
frequency: 6.4123 24.8013 28.2004 41.7966 66.7370 74.8861 84.1334 92.2492 140.8533 166.2338 188.2774 201.7572 215.3467 225.0379 242.3407 288.4336 304.5145 332.1185 372.3025 391.7003 401.9409 409.5649 427.4497 440.1419 472.2709 490.2741 537.8590 556.2694 569.5897 612.3442 615.2853 619.9781 623.6718 659.8088 663.7947 698.8327 702.2824 715.8491 719.2302 746.4246 771.8543 789.7534 804.7097 829.7535 850.2788 851.1892 858.3346 881.3734 912.4534 916.7156 929.5696 933.8250 936.9715 947.6523 951.7135 962.9921 976.8793 985.6461 987.8502 988.8534 989.9127 996.2677 999.5277 1017.1623 1025.9835 1030.9437 1049.1823 1083.3637 1085.8869 1092.8986 1126.4711 1147.8642 1163.4362 1170.9327 1172.8015 1173.2847 1188.4642 1194.9120 1198.8861 1214.5431 1249.5480 1260.6234 1283.5702 1291.2300 1296.3432 1314.1519 1316.0837 1324.9268 1342.4735 1375.9849 1381.5604 1383.6939 1424.4131 1431.3594 1439.7763 1456.8002 1459.2628 1473.2947 1477.7279 1479.2851 1484.4461 1491.6389 1553.4982 1579.5827 1583.3130 1587.7469 1605.6690 1608.9458 1622.3954 2969.8871 2974.4751 3006.0495 3019.6489 3044.7226 3051.1024 3079.0362 3117.8710 3124.7251 3124.9808 3134.8523 3135.5001 3141.8060 3147.1668 3147.8556 3149.4541 3159.7462 3160.4736 3169.6243 3173.9216
redmass: 3.8723 4.7223 4.9189 4.3390 4.2367 4.2615 4.5359 4.9643 2.6123 4.1245 3.1834 4.4405 3.1511 3.6696 4.3210 4.8631 4.7532 3.9673 4.5156 5.0648 2.8334 2.8881 2.9531 4.1619 4.5468 4.1608 5.0636 4.9019 3.1563 6.2345 6.2552 2.5290 5.9629 4.8343 5.3978 1.6475 1.8228 2.7268 4.0945 3.1193 2.1497 2.3310 3.9792 1.3926 1.3366 2.0228 1.2451 1.5096 2.3821 2.3440 2.2216 1.5767 1.5024 1.6611 2.6885 2.1212 1.3955 1.4310 2.4115 6.0381 3.5266 1.3344 1.3467 2.3175 2.2885 2.0108 1.6786 1.6001 1.6209 2.6422 1.2907 1.6451 1.2779 1.2936 1.0725 1.7787 1.1577 1.1188 1.5773 1.4147 1.9155 1.2375 2.0046 1.4186 2.5596 1.4526 1.4018 1.4941 1.9996 7.2741 7.6742 4.4404 2.7048 2.3073 4.0891 1.1156 1.1775 2.7109 2.5464 1.1100 2.5508 3.7443 6.9451 5.7863 6.2536 6.4249 5.9951 6.0919 7.2157 1.0659 1.0661 1.0644 1.0881 1.0948 1.0941 1.1041 1.0872 1.0847 1.0848 1.0885 1.0885 1.0962 1.0929 1.0937 1.0931 1.0967 1.0973 1.0996 1.0981
irintensity: 0.2406 0.1628 0.7766 0.5373 0.2871 0.3325 0.8849 0.0345 2.4372 1.0112 2.3121 0.5064 6.7393 3.4350 0.3062 2.3383 1.0678 0.9055 2.5834 1.3218 0.1255 0.2743 6.5339 2.6490 4.0283 1.1613 2.3263 5.3044 5.4577 0.6492 0.1847 2.1407 7.7137 25.5380 16.8959 87.2454 34.4476 5.8847 3.2075 2.5922 21.1535 41.6982 13.5233 25.6835 1.1063 7.4919 1.4119 2.9034 1.9301 10.7070 1.7332 4.3163 1.5837 3.6967 2.6868 2.0113 0.7191 1.8810 17.8707 1.2796 13.3775 0.8070 2.3025 1.4190 5.9483 6.7923 5.9978 7.7111 4.3366 11.5097 0.6449 5.0760 15.8721 0.4686 0.1983 0.5440 11.1071 2.7694 4.0539 0.4083 27.1115 3.8763 1.3889 11.1317 43.6106 3.5614 7.2970 11.6174 2.5539 1.4945 1.0356 31.8534 1.2914 13.2053 19.4571 15.4683 5.2621 22.0714 9.9988 9.2518 42.5436 4.7330 106.1857 0.9771 8.6865 44.6104 3.0669 0.0774 8.7475 40.7513 25.3905 44.4525 26.0995 37.5882 34.0513 54.3294 10.9330 1.3427 0.5838 4.5072 9.0831 33.0994 1.1662 47.9266 10.5944 14.1955 48.6016 25.2521 6.5908
temp: 298.150 k
press: 1.00000 atm
elementType: 7 7 6 6 6 6 6 6 6 6 6 6 6 6 6 6 6 6 6 6 6 6 6 6 6 1 1 1 1 1 1 1 1 1 1 1 1 1 1 1 1 1 1 1 1
symmnumber: 1
zpe: 950877.7 jmol-1
zpe.correction: 0.362170 hartree
zpe.thermalcorrener: 0.382917 hartree
zpe.thermalcorrenthalpy: 0.383861 hartree
zpe.thermalcorrgfe: 0.309003 hartree
zpe.sumelectzpe: -996.200896 hartree
zpe.sumelectthermal: -996.180149 hartree
zpe.sumelectthermalent: -996.179204 hartree
zpe.sumelectthermalfe: -996.254062 hartree
dipole: 1.3895 1.2219 -0.5015
dipole: 1.9171
quadrupole: -116.3613 -131.2128 -146.6725
quadrupole: -0.7031 -3.4871 0.3584
quadrupole: 15.0543 0.2027 -15.2570 -0.7031 -3.4871 0.3584
hfenergy: -996.5630659 hartree
pointgroup: C01 [X(C23H20N2)]
dipole: -0.5528663 0.4594645 0.2282775 debye
polarizability: 513.4303619|11.8274461|287.9187133|-34.553712|-2.453869|152.6365127 unknown
InChI: InChI=1S/C23H20N2/c1-3-8-20(9-4-1)23(21-10-5-2-6-11-21)25-24-17-18-14-15-19-12-7-13-22(19)16-18/h1-6,8-11,14-17H,7,12-13H2
charge 0 multiplicity 1
45 atoms
N  -0.107699 -0.65493 -0.07851
N  1.234968 -1.09021 -0.070179
C  -6.615455 0.669683 -0.72737
C  -5.178714 1.262425 -0.578027
C  -6.666949 -0.51977 0.282679
C  -4.353986 0.064276 -0.122357
C  -5.212462 -0.960796 0.371898
C  -2.962448 -0.103543 -0.122455
C  -4.671491 -2.164256 0.867281
C  -2.403879 -1.324026 0.367074
C  -3.269699 -2.341689 0.861068
C  -0.958354 -1.56096 0.372425
C  2.171747 -0.141214 -0.05284
C  1.906347 1.321003 0.11166
C  3.57294 -0.626926 -0.21824
C  2.578831 2.261151 -0.719089
C  4.676641 0.111201 0.293103
C  0.963999 1.804762 1.060288
C  3.825893 -1.867243 -0.870911
C  2.308039 3.64173 -0.612727
C  5.994799 -0.374327 0.150833
C  0.707512 3.187384 1.178587
C  5.142074 -2.345809 -1.01791
C  1.373667 4.111084 0.340283
C  6.234607 -1.601833 -0.507721
H  -6.744986 0.281147 -1.754659
H  -7.407214 1.417358 -0.547198
H  -5.16091 2.0548 0.197997
H  -4.80315 1.717054 -1.511899
H  -7.348046 -1.328033 -0.039202
H  -7.021827 -0.17445 1.275875
H  -2.281687 0.669288 -0.495432
H  -5.325248 -2.957571 1.24751
H  -2.834275 -3.277121 1.234429
H  -0.592508 -2.52218 0.7776
H  3.297896 1.903188 -1.463916
H  4.500218 1.055815 0.818072
H  0.447375 1.097966 1.71541
H  2.971918 -2.435924 -1.251013
H  2.824431 4.349168 -1.271083
H  6.832674 0.202437 0.558263
H  -0.013968 3.543143 1.922469
H  5.321075 -3.297869 -1.530233
H  1.168766 5.183964 0.429278
H  7.258237 -1.976252 -0.621408
