program: Gaussian 09
title: 000291846
version: EM64L-G09RevD.01
frameworkgroup: C1[X(C12H10N2S)]
method: RPBEPBE
basis: SDD
operation: Freq
keyword: #p
keyword: freq=noraman
keyword: PBEPBE/SDD
title: #p freq=noraman PBEPBE/SDD
converged: YES YES NO NO
title: Mulliken charges:
elementType: S N N C C C C C C C C C C C C H H H H H H H H H H
charge: 0.228499 -0.212385 -0.332449 0.545552 0.257905 -0.486311 0.454647 -0.297466 -0.490507 -0.174630 -0.320783 -0.668292 -0.438924 -0.286412 -0.243606 0.244474 0.243336 0.244949 0.237283 0.301174 0.237462 0.241260 0.228077 0.231412 0.255733
chargesum: 0.00000
title: Mulliken charges with hydrogens summed into heavy atoms:
elementType: S N N C C C C C C C C C C C C
charge: 0.228499 -0.212385 -0.076715 0.545552 0.257905 -0.486311 0.454647 -0.052992 -0.247170 -0.174630 -0.075834 0.107627 -0.197664 -0.058334 -0.012194
polarizability: 2.58536270e+02 4.85256241e-02 1.82180446e+02 1.86307215e-02 2.49722500e-02 6.41731093e+01
1716.lowfreq: -9.9266 -6.6956 -0.3474 -0.0024 -0.0020 -0.0019 31.8974 80.5568 117.3947
frequency: 31.6787 80.5553 117.3945 194.5024 216.1908 250.0223 299.7323 310.3595 315.7155 357.7831 398.0411 423.4065 442.0191 461.7149 504.0332 509.4085 548.3130 551.6340 591.7792 628.4799 661.1627 671.7993 685.6803 749.2738 757.8873 792.0349 811.9455 835.1799 866.0824 879.6975 937.5268 945.4622 964.5806 989.9188 1019.8809 1040.8069 1080.9991 1121.8619 1133.1858 1156.0371 1160.1566 1180.7931 1227.5296 1252.8864 1261.8612 1305.4479 1383.6584 1396.4046 1404.2755 1423.8290 1440.7323 1451.6769 1484.1135 1505.2370 1523.2203 1573.2761 1589.0426 1625.0715 1635.0674 2988.5339 3085.5967 3106.1498 3124.4050 3137.3338 3138.8656 3161.1211 3163.4310 3222.0017 3472.1651
redmass: 3.1757 4.9636 6.0736 3.8705 5.1977 3.6981 1.8710 2.0503 4.4912 6.0803 4.4116 2.9327 6.7402 7.6048 3.7550 5.2634 6.3728 4.0333 5.4160 7.5770 6.8019 3.7793 1.2247 1.2600 5.2852 2.7195 1.4156 4.1928 6.2547 1.7492 2.7074 1.3362 1.4055 1.3522 2.6121 2.2258 2.2149 1.2897 1.8268 1.4459 1.9768 1.1813 2.0693 2.4561 1.7288 2.6431 2.6775 3.6952 5.3246 1.7886 2.0497 2.0855 1.1245 1.0471 3.5955 7.3372 6.7883 6.3446 6.4439 1.0333 1.1037 1.0997 1.0866 1.0897 1.0887 1.0989 1.0980 1.0908 1.0789
irintensity: 1.2132 0.1077 1.9427 9.3798 1.1194 0.5541 0.0247 0.2459 0.2129 0.1000 17.2004 7.4657 15.3222 10.1107 0.0034 3.9902 6.0662 0.8500 19.4126 1.5898 7.9404 1.1329 103.8664 24.5356 3.9391 23.1998 56.8876 17.8251 2.0804 14.5455 133.0242 0.0021 3.2092 0.7639 131.5685 30.5768 87.6183 0.0837 47.3077 2.0966 20.6212 4.1850 0.8695 22.0104 3.4260 18.0956 68.8305 28.4881 21.5972 19.5504 81.4219 27.8589 51.8788 17.8769 44.5922 6.3403 8.4448 117.4416 376.1430 37.9800 21.8024 1.2870 1.4718 5.7688 13.7590 32.2762 15.1194 9.3003 44.3903
temp: 298.150 k
press: 1.00000 atm
elementType: 16 7 7 6 6 6 6 6 6 6 6 6 6 6 6 1 1 1 1 1 1 1 1 1 1
symmnumber: 1
zpe: 500982.0 jmol-1
zpe.correction: 0.190814 hartree
zpe.thermalcorrener: 0.202810 hartree
zpe.thermalcorrenthalpy: 0.203754 hartree
zpe.thermalcorrgfe: 0.152278 hartree
zpe.sumelectzpe: -969.809521 hartree
zpe.sumelectthermal: -969.797525 hartree
zpe.sumelectthermalent: -969.796581 hartree
zpe.sumelectthermalfe: -969.848057 hartree
dipole: 1.7841 -0.0323 0.0009
dipole: 1.7844
quadrupole: -88.3451 -84.8914 -100.8555
quadrupole: -3.0350 -0.0015 0.0100
quadrupole: 3.0189 6.4726 -9.4915 -3.0350 -0.0015 0.0100
hfenergy: -970.0003351 hartree
pointgroup: C01 [X(C12H10N2S1)]
dipole: 0.7004143 0.0478303 0.0031153 debye
dipolederiv: -0.4401838 0.0400143 -0.0026648 0.3991831 -0.459854 0.0031154 -0.0036786 0.001086 0.0523006 -1.5051466 0.4245616 -0.0075689 0.040624 -0.7025401 0.0008639 -0.0073267 0.0030527 -0.1745477 -1.5650599 0.4943924 -0.0064947 0.9449735 -0.6619321 0.0055658 -0.0070084 0.0031558 -0.4857698 0.4674261 -0.5649323 0.0028319 -0.9166397 0.2891191 -0.0050013 0.003701 -0.0034082 0.0833955 0.1361438 0.2675821 0.0005342 -0.0013171 0.0079374 0.0001152 0.0012098 0.0016867 -0.0121375 0.7078825 0.0782758 0.0041809 0.4605097 -0.3157138 0.0027581 0.0041763 0.0014752 -0.1219262 -0.0459109 0.0559845 -0.0006122 0.3077792 0.0211724 0.0013013 -0.0011713 -0.0000611 0.0619048 0.0731444 -0.0506327 0.0005694 -0.2320508 0.1716412 -0.001715 0.0004851 -0.0012496 -0.1045571 -0.2223552 0.0005063 -0.0003685 -0.0805861 -0.0130954 -0.0003675 -0.0000572 -0.0001071 -0.2119769 2.0114834 -0.5145841 0.0114539 -0.5119672 0.9554103 -0.0045102 0.0116395 -0.0043726 0.05751 -0.1114028 -0.0851185 -0.0001238 0.0026379 -0.0075612 0.0002522 -0.0002546 -0.000048 -0.1387577 -0.054356 0.0230589 -0.0015532 0.0505531 0.4283132 0.0001705 -0.0019629 0.0001556 0.2291572 0.0348904 -0.0510323 0.0009784 -0.1520482 0.0681405 -0.0007724 0.0011692 -0.0004272 -0.1741776 -0.0534644 0.0620238 0.0005377 -0.0709956 0.1221141 0.0001142 0.0007842 0.000726 -0.1707626 0.0816868 -0.052947 0.0008416 0.0337222 -0.0698752 0.0001243 0.0005834 -0.0003405 -0.1609492 0.0754339 -0.090491 -0.0001828 -0.0460208 -0.0400415 0.0001423 -0.000156 0.0000089 0.1608684 -0.0269164 0.1223033 -0.0008788 0.0501833 -0.0136584 0.0003333 -0.000703 0.0007846 0.1647137 0.0818322 0.0817067 0.0000436 0.0485438 -0.0327283 0.0000117 -0.0001058 -0.0000549 0.1393087 0.0637641 -0.1143415 -0.0948403 -0.0325602 -0.0018845 -0.0146486 -0.0874352 -0.047782 -0.0528225 0.0384523 0.1669335 -0.0011024 0.0014128 0.149993 -0.0000735 -0.0007419 0.0008979 0.131716 0.0613872 -0.1145227 0.0967797 -0.0323388 -0.0012432 0.0137582 0.0891367 0.0457437 -0.0505089 0.0120971 0.0513134 -0.0005958 0.1323458 -0.0467435 0.0006168 -0.000568 0.0003793 0.1546721 0.0469052 -0.0650022 -0.0005356 -0.0930063 -0.1024549 -0.0006595 -0.0005735 -0.0006024 0.1598577 -0.1450058 -0.0326356 -0.0012297 -0.0364091 0.0881022 -0.0001619 -0.0011995 -0.0001303 0.1635475 0.2772723 -0.1324166 0.0000003 -0.2665285 0.1673827 -0.0013335 0.0000576 -0.0005685 0.2999417 unknown
polarizability: 258.3452675|3.7685753|182.3667362|0.9478252|-0.0863991|64.1778219 unknown
InChI: InChI=1S/C12H10N2S/c1-14-11-9-5-3-2-4-8(9)6-7-10(11)15-12(14)13/h2-7,13H,1H3
charge 0 multiplicity 1
25 atoms
S  -2.801673 -1.540357 -0.018781
N  -1.664361 0.882139 -0.016382
N  -4.045345 1.035966 -0.030117
C  -0.573726 -0.02646 -0.009397
C  0.846657 0.266964 -0.002864
C  -0.995758 -1.37533 -0.009485
C  1.761403 -0.870558 0.001552
C  -0.101223 -2.472207 -0.0045
C  1.26865 -2.215734 0.000632
C  -2.962472 0.317132 -0.022843
C  1.432587 1.580987 0.000686
C  -1.586234 2.354847 -0.019413
C  3.177089 -0.638644 0.007356
C  2.817198 1.768239 0.00657
C  3.705471 0.651115 0.009568
H  -0.485927 -3.496392 -0.00433
H  1.98653 -3.042807 0.00418
H  0.802487 2.468311 -0.000668
H  -1.081459 2.726019 0.888946
H  -2.624325 2.720979 -0.027475
H  -1.06865 2.721675 -0.922369
H  3.84266 -1.51008 0.010384
H  3.222649 2.785888 0.00928
H  4.788886 0.810033 0.013766
H  -4.936611 0.519675 -0.034697
