program: Gaussian 09
title: 000291891
version: EM64L-G09RevD.01
frameworkgroup: C1[X(C12H20N2O2)]
method: RPBEPBE
basis: SDD
operation: Freq
keyword: #p
keyword: freq=noraman
keyword: PBEPBE/SDD
title: #p freq=noraman PBEPBE/SDD
converged: YES YES NO NO
title: Mulliken charges:
elementType: O O N N C C C C C C C C C C C C H H H H H H H H H H H H H H H H H H H H
charge: -0.196854 -0.207563 -0.301613 -0.325805 0.095877 0.128107 -0.416689 -0.391976 -0.346917 -0.341179 -0.058474 -0.012840 -0.336338 -0.339272 -0.685355 -0.691525 0.230188 0.203712 0.212533 0.274248 0.212023 0.208637 0.172845 0.217293 0.322713 0.290757 0.199803 0.187022 0.191535 0.212410 0.216100 0.221689 0.211704 0.206223 0.221137 0.215846
chargesum: 0.00000
title: Mulliken charges with hydrogens summed into heavy atoms:
elementType: O O N N C C C C C C C C C C C C
charge: -0.196854 -0.207563 0.021100 -0.035048 0.095877 0.128107 0.017212 0.094806 0.073743 0.048958 -0.058474 -0.012840 0.050488 0.064673 -0.035863 -0.048320
polarizability: 1.95872040e+02 2.98939288e+00 1.81282303e+02 4.53208761e+00 1.67590973e+01 1.08714546e+02
1716.lowfreq: -6.8322 -4.2988 0.0005 0.0007 0.0007 6.2116 10.2302 16.5418 35.5681
frequency: 8.9477 15.8553 35.5555 47.9306 56.8640 78.3169 92.5671 106.1720 109.6417 133.5789 168.4086 180.7019 198.5877 220.8817 227.2629 240.1328 253.6376 285.3962 311.5191 392.7599 395.7449 441.3097 484.3740 510.7013 520.0264 548.6692 574.8681 599.4361 646.8816 734.3605 738.9666 758.6517 774.8568 793.5568 808.5560 896.9961 899.6060 915.9379 922.1393 951.5258 964.9030 1004.4184 1023.7824 1052.3048 1069.5141 1073.3428 1094.0460 1111.2780 1115.3894 1119.6470 1174.9171 1184.6554 1229.1701 1234.4065 1268.8688 1270.1374 1286.0739 1288.7638 1295.5212 1299.0846 1340.8908 1346.1906 1356.0606 1365.2033 1391.3758 1392.7268 1405.2328 1461.5492 1466.3577 1469.6692 1471.8241 1474.8049 1477.5276 1478.9067 1481.5211 1483.6541 1490.4223 1491.3385 1517.7435 1613.1858 1655.0418 1791.1324 2957.5301 2960.1388 2969.6552 2969.9549 2974.2906 2974.9888 2977.4570 2978.7630 3004.5769 3012.7719 3030.6178 3036.5096 3056.6604 3068.1449 3073.1861 3074.6090 3076.5734 3078.9430 3515.2798 3525.6304
redmass: 3.5019 3.5593 4.8993 5.0190 1.6159 1.7179 5.4484 2.3979 2.6901 2.5463 3.9489 3.4640 3.2029 2.9421 1.3011 1.1785 4.5435 4.0965 5.7261 2.8468 2.2907 3.5120 4.2252 1.4508 1.3407 10.2251 4.2157 5.2368 5.9502 1.0760 1.0786 11.8835 1.8774 1.2131 2.0887 1.8769 1.7549 1.6106 1.6065 2.5355 2.5406 4.4993 3.2823 3.2181 2.5304 2.4891 4.1480 2.3531 2.4566 2.2345 2.1482 2.3595 1.3988 1.4572 1.2824 1.2960 1.1012 1.0891 1.1231 1.1528 1.4094 1.4530 1.4700 1.3966 1.2203 1.2121 1.6606 1.3267 1.0833 1.0802 1.0749 1.0766 1.0426 1.0430 1.0784 1.0785 1.0997 1.1101 2.3669 8.5240 11.7526 11.8218 1.0629 1.0601 1.0627 1.0626 1.0608 1.0408 1.0503 1.0495 1.0975 1.0951 1.0986 1.0996 1.1029 1.1008 1.1012 1.1006 1.0995 1.0996 1.0761 1.0765
irintensity: 1.4639 0.1565 3.4340 2.2225 0.2650 0.6718 0.0973 0.3590 0.2361 2.1852 0.0996 3.7967 0.0252 1.0202 0.0376 0.0378 3.3392 0.3156 1.7384 0.6758 2.8896 3.7634 10.3106 134.0302 87.0922 1.3314 4.1900 1.5127 4.6981 6.6469 11.2774 0.0596 6.6077 0.3046 3.3703 4.9761 5.4293 1.5300 6.3050 4.4498 2.6289 8.3070 1.9242 26.2914 0.2966 1.9108 28.2292 22.1552 26.9071 17.7127 11.6253 0.8549 23.1165 1.6318 2.4880 0.2964 1.3023 1.3578 21.1868 53.4332 12.1643 1.3060 45.7593 34.9918 6.6646 17.0724 128.4580 48.3256 2.5926 9.9531 9.8339 4.2095 9.9866 13.8638 22.1524 19.4238 19.6300 31.1840 483.0978 948.3324 258.8338 1.3640 21.8378 20.2870 10.1418 13.8489 90.1188 33.3237 37.7780 70.3724 11.4803 4.6511 6.8552 29.3207 43.7503 7.9683 72.8863 87.5569 45.5553 47.8845 22.2188 51.9296
temp: 298.150 k
press: 1.00000 atm
elementType: 8 8 7 7 6 6 6 6 6 6 6 6 6 6 6 6 1 1 1 1 1 1 1 1 1 1 1 1 1 1 1 1 1 1 1 1
symmnumber: 1
zpe: 801382.8 jmol-1
zpe.correction: 0.305231 hartree
zpe.thermalcorrener: 0.324269 hartree
zpe.thermalcorrenthalpy: 0.325214 hartree
zpe.thermalcorrgfe: 0.253746 hartree
zpe.sumelectzpe: -727.946660 hartree
zpe.sumelectthermal: -727.927621 hartree
zpe.sumelectthermalent: -727.926677 hartree
zpe.sumelectthermalfe: -727.998145 hartree
dipole: -1.5409 9.2982 2.8729
dipole: 9.8532
quadrupole: -86.1211 -127.7390 -98.0183
quadrupole: -4.0695 -1.1633 -5.3917
quadrupole: 17.8384 -23.7795 5.9411 -4.0695 -1.1633 -5.3917
hfenergy: -728.2518907 hartree
pointgroup: C01 [X(C12H20N2O2)]
dipole: -1.4021888 -3.3896227 -1.2537371 debye
polarizability: 190.8846679|-8.6382254|185.0569031|13.9091935|13.5179666|109.9273174 unknown
InChI: InChI=1S/C12H20N2O2/c1-3-5-7-13-9-10(12(16)11(9)15)14-8-6-4-2/h13-14H,3-8H2,1-2H3
charge 0 multiplicity 1
36 atoms
O  -1.048208 4.007105 0.577266
O  2.053693 2.55046 0.586645
N  -2.32195 1.339904 -0.724949
N  0.745625 -0.168147 -0.737501
C  -1.052288 1.651979 -0.350199
C  0.231295 1.033298 -0.355976
C  -2.760737 0.027211 -1.227835
C  2.174505 -0.521234 -0.570827
C  -2.897009 -1.052075 -0.124762
C  2.387847 -1.69783 0.406927
C  -0.517387 2.91885 0.245552
C  0.880355 2.255813 0.247451
C  -3.337318 -2.420019 -0.694493
C  3.881438 -2.077908 0.532456
C  -3.481468 -3.499305 0.400035
C  4.115749 -3.260081 1.496798
H  -3.735156 0.164641 -1.731872
H  -2.0541 -0.318393 -2.009883
H  2.603268 -0.779309 -1.560641
H  2.695973 0.380158 -0.205152
H  -3.630765 -0.707097 0.629927
H  -1.930581 -1.16034 0.408621
H  1.812947 -2.584049 0.062106
H  1.985923 -1.420654 1.40094
H  -3.028309 2.056293 -0.541602
H  0.128403 -0.889168 -1.117175
H  -4.302758 -2.302544 -1.227536
H  -2.603465 -2.759906 -1.45506
H  4.281334 -2.332057 -0.470625
H  4.451969 -1.194438 0.881864
H  -4.236349 -3.202556 1.151537
H  -3.794749 -4.468143 -0.029119
H  -2.524478 -3.657733 0.931484
H  3.583166 -4.167002 1.153062
H  5.189832 -3.508371 1.573892
H  3.751154 -3.02055 2.513146
