program: Gaussian 09
title: 000291844
version: EM64L-G09RevD.01
frameworkgroup: C1[X(C10H11N3O)]
method: RPBEPBE
basis: SDD
operation: Freq
keyword: #p
keyword: freq=noraman
keyword: PBEPBE/SDD
title: #p freq=noraman PBEPBE/SDD
converged: YES YES NO NO
title: Mulliken charges:
elementType: O N N N C C C C C C C C C C H H H H H H H H H H H
charge: -0.283470 -0.219250 -0.353915 -0.695146 0.408697 0.387523 -0.537261 0.168187 -0.349595 -0.366329 -0.765298 -0.412159 -0.394502 0.507318 0.322433 0.273944 0.239716 0.268182 0.250573 0.251938 0.233204 0.222541 0.224130 0.309641 0.308899
chargesum: 0.00000
title: Mulliken charges with hydrogens summed into heavy atoms:
elementType: O N N N C C C C C C C C C C
charge: -0.283470 -0.219250 -0.031482 -0.076606 0.408697 0.387523 -0.263317 0.168187 -0.109879 -0.098147 -0.029583 -0.189618 -0.170372 0.507318
polarizability: 2.33827053e+02 -4.39382110e+00 1.23861549e+02 1.65983193e+00 -9.62972013e+00 7.31141622e+01
1716.lowfreq: -4.8648 0.0007 0.0007 0.0010 4.8598 10.3349 45.7699 54.9116 81.0938
frequency: 45.7450 54.8680 81.0899 144.1228 172.8421 188.5241 245.1656 268.1648 323.7116 355.8214 363.2418 368.1697 373.9911 411.0825 418.0708 454.0728 502.4817 551.5166 572.4918 594.4237 606.7518 640.2163 684.6555 715.5422 755.2906 787.6990 810.3813 821.3327 827.6262 935.2646 945.4590 955.6158 979.2898 990.9195 1005.6229 1017.5905 1045.1395 1108.9460 1129.1935 1175.1954 1184.1796 1195.5779 1277.8985 1309.1513 1321.7352 1334.4357 1379.0360 1404.5152 1428.5110 1445.6692 1463.8593 1476.0903 1517.0887 1571.8620 1579.2825 1634.4554 1647.1502 1651.7129 2987.8137 3066.4694 3109.4942 3125.7161 3128.0871 3156.7239 3161.1660 3246.5430 3553.1626 3568.3144 3707.6757
redmass: 3.7864 5.4768 5.2690 1.0969 4.6720 3.1430 4.8705 5.6233 3.9491 2.6721 2.3448 1.1840 1.8168 2.6762 3.6896 1.2789 2.7161 3.0746 5.0665 5.9966 5.3289 6.5544 3.1664 3.6351 4.7704 1.5214 1.4130 3.5750 1.7680 1.3836 3.0092 1.4031 3.8722 1.6018 2.4257 1.4378 1.4947 4.1598 1.2756 2.0275 1.1221 2.9350 2.0665 1.3956 2.5917 2.8249 5.1120 1.2392 3.3666 2.7937 1.0929 1.2649 3.2565 6.0340 7.1256 2.2053 2.0715 5.0018 1.0385 1.0974 1.0980 1.0889 1.0885 1.0950 1.0961 1.0987 1.0809 1.0450 1.1040
irintensity: 1.3447 2.0738 1.3741 0.2276 5.2893 2.9326 2.6925 3.1912 15.5159 62.1711 65.5024 10.4866 210.6182 8.7706 10.3045 130.5498 18.6077 5.7399 10.2315 3.8749 12.0308 0.3761 3.9943 0.4793 10.2619 45.2389 6.7610 3.4734 87.9174 1.5684 14.6155 1.6122 3.7591 2.2273 1.7631 0.2479 6.0754 2.2426 20.3031 6.1369 15.6245 2.6906 56.3316 27.8439 26.2290 73.2629 15.6200 17.4394 112.2653 29.3413 13.8135 4.9351 410.2214 18.8067 8.1272 0.9709 600.4835 342.3000 16.6688 13.4516 17.3887 10.0411 33.4996 12.1461 1.3460 0.0512 32.7539 103.9185 22.9174
temp: 298.150 k
press: 1.00000 atm
elementType: 8 7 7 7 6 6 6 6 6 6 6 6 6 6 1 1 1 1 1 1 1 1 1 1 1
symmnumber: 1
zpe: 514757.3 jmol-1
zpe.correction: 0.196061 hartree
zpe.thermalcorrener: 0.208928 hartree
zpe.thermalcorrenthalpy: 0.209872 hartree
zpe.thermalcorrgfe: 0.156714 hartree
zpe.sumelectzpe: -626.121111 hartree
zpe.sumelectthermal: -626.108243 hartree
zpe.sumelectthermalent: -626.107299 hartree
zpe.sumelectthermalfe: -626.160458 hartree
dipole: -8.9302 2.9561 0.0959
dipole: 9.4072
quadrupole: -85.1360 -76.5949 -82.9451
quadrupole: 15.9639 1.7949 -2.6238
quadrupole: -3.5774 4.9638 -1.3864 15.9639 1.7949 -2.6238
hfenergy: -626.3171713 hartree
pointgroup: C01 [X(C10H11N3O1)]
dipole: 3.485838 1.243553 -0.0241901 debye
dipolederiv: -1.2294286 -0.4034572 0.0617224 -0.8733549 -0.8961145 0.0913324 0.1479642 0.115436 -0.4091787 -1.3179653 0.0306614 -0.1395604 0.4524338 -0.0279605 -0.0010939 -0.6185935 -0.0004649 -0.1335457 -0.6898155 0.043135 0.0654562 0.5807623 -0.3676609 -0.0134896 0.2807673 -0.1142521 -0.1888138 -1.8637278 0.0999179 0.0510611 0.1093671 -0.2707263 0.2912155 0.0777522 0.292442 -0.5646528 1.2780519 0.080739 0.1351183 -0.4563014 0.3604289 -0.1441198 0.2567364 -0.0702247 0.0764613 1.0505549 -0.0461407 -0.004879 -0.0545907 -0.187215 0.0107569 0.1382415 -0.0298145 -0.016351 -0.6868379 -0.1451958 0.0318725 -0.7174214 -0.5667657 0.0311195 0.1297236 0.0945217 -0.3138876 1.450424 0.4706039 -0.0566747 1.0769127 1.1538504 -0.1782231 -0.186528 -0.197132 0.2235469 0.095093 0.1367063 0.0885476 -0.124628 0.0369504 0.1041296 0.0079595 0.0887174 -0.0690449 0.0402459 -0.1555971 -0.0989215 0.1113593 0.0341 0.0968677 -0.0387386 0.1150424 -0.0498834 0.011719 -0.069373 0.0276233 -0.0257457 -0.1090672 0.0624786 -0.0047053 0.026466 0.0792093 -0.3732417 -0.0666254 -0.0491074 0.4201821 -0.0250521 0.1320462 0.2883594 0.1338994 -0.1341421 -0.4255251 0.1253154 0.0649895 -0.3376664 0.0268992 0.1513161 -0.2474435 0.1544909 -0.1276502 1.869265 -0.1115352 -0.0677977 -0.1247385 -0.014116 -0.0960374 -0.0853995 -0.1104206 0.0799492 0.1999684 -0.0138098 -0.0477986 -0.0426015 0.2294164 0.037407 -0.1496016 0.0707178 0.2526294 0.0149835 0.0563116 -0.0382344 0.0528231 0.0524954 0.0504795 0.0112682 0.0284811 0.1917705 0.0659636 0.0709195 0.0553413 0.0629337 0.0126744 -0.0855053 0.065002 -0.083711 0.0943391 0.0673249 -0.0699694 -0.0398834 -0.0688097 0.057446 -0.0662043 -0.0521619 -0.0611105 0.1100367 -0.0373524 0.1084116 -0.0925065 0.0348142 0.0501301 0.0416084 -0.0703743 0.0782278 0.0659221 -0.0071053 -0.0380665 0.1090133 -0.0112346 0.0645699 -0.0275098 0.1119221 -0.0017024 0.0435465 0.0895258 -0.0839534 -0.0455942 -0.0453484 -0.0114915 -0.0427615 -0.0535253 -0.1009187 -0.0492543 -0.0403272 -0.0857178 -0.0577597 -0.0852366 0.0172659 -0.0976066 -0.0597677 -0.0906229 0.1071365 -0.0164684 0.0814196 0.0519043 0.080696 -0.0053799 -0.1064812 0.0613637 -0.0990498 0.1021456 0.2224779 -0.0201341 -0.009183 -0.0562532 0.1957895 -0.1194175 -0.0341193 -0.1165455 0.316316 0.2321973 0.0054342 0.0052509 0.0416468 0.1895329 -0.1223077 0.0238985 -0.122473 0.3133957 unknown
polarizability: 233.5596091|6.8846091|124.0358353|1.8408692|9.9039058|73.2073194 unknown
InChI: InChI=1S/C10H11N3O/c1-7-6-10(14)12-13(7)9-4-2-8(11)3-5-9/h2-6,12H,11H2,1H3
charge 0 multiplicity 1
25 atoms
O  -4.031319 -1.703274 0.266652
N  -0.966437 0.086826 0.221629
N  -1.722574 -1.11137 0.316714
N  4.699661 -0.230236 -0.070801
C  -1.845127 1.090444 -0.209953
C  0.461183 0.016264 0.133566
C  -3.135165 0.574937 -0.272353
C  -3.119267 -0.836047 0.110112
C  1.268658 0.9979 0.76178
C  1.087011 -1.058068 -0.551235
C  -1.354888 2.464838 -0.568153
C  2.670898 0.926958 0.681301
C  2.488469 -1.145917 -0.610171
C  3.309153 -0.149408 -0.002818
H  -1.378868 -1.845935 0.939504
H  -4.032301 1.123141 -0.546255
H  0.797701 1.807753 1.328204
H  0.466447 -1.813562 -1.044398
H  -2.136592 2.994719 -1.134784
H  -0.441198 2.421449 -1.187933
H  -1.120819 3.068131 0.328493
H  3.279309 1.697715 1.169217
H  2.955662 -1.983839 -1.141392
H  5.154146 -1.001499 -0.550299
H  5.285956 0.47568 0.364171
