program: Gaussian 09
title: 000291847
version: EM64L-G09RevD.01
frameworkgroup: C1[X(C16H11NO3)]
method: RPBEPBE
basis: SDD
operation: Freq
keyword: #p
keyword: freq=noraman
keyword: PBEPBE/SDD
title: #p freq=noraman PBEPBE/SDD
converged: YES YES NO NO
title: Mulliken charges:
elementType: O O O N C C C C C C C C C C C C C C C C H H H H H H H H H H H
charge: -0.241112 -0.380372 -0.243342 -0.488753 0.174960 0.249681 0.204216 0.063839 0.071225 0.294778 -0.395766 -0.358326 -0.371278 -0.433848 -0.205577 -0.257274 0.058186 -0.238357 -0.227150 -0.232109 0.332271 0.233794 0.282674 0.296722 0.255213 0.233118 0.236278 0.237888 0.233091 0.236325 0.379003
chargesum: 0.00000
title: Mulliken charges with hydrogens summed into heavy atoms:
elementType: O O O N C C C C C C C C C C C C C C C C
charge: -0.241112 -0.001369 -0.243342 -0.156482 0.174960 0.249681 0.204216 0.063839 0.071225 0.294778 -0.161972 -0.075652 -0.074555 -0.178635 0.027541 -0.020995 0.058186 -0.000470 0.005941 0.004216
polarizability: 2.84193795e+02 8.53467053e-01 2.01529422e+02 7.00806411e+00 -1.19677627e+01 1.02615531e+02
1716.lowfreq: -0.0007 -0.0003 0.0002 1.0547 6.4606 8.3205 40.8801 51.8701 57.1277
frequency: 40.8699 51.8608 57.1174 64.0710 96.8869 128.9824 152.6373 193.6306 207.8674 247.8759 267.6153 282.9508 310.7494 335.4531 406.0873 419.4086 460.0566 483.3629 499.4126 532.3686 549.8435 564.0499 578.6285 613.7352 621.2267 626.2080 659.1227 663.5291 680.5527 700.8014 707.4909 718.4932 770.5414 777.3326 803.6909 821.9832 859.8017 875.9735 885.4359 932.2130 945.7074 968.0241 983.7173 988.3121 1002.4285 1003.9255 1021.8207 1030.3961 1044.2887 1087.9183 1102.5610 1159.6415 1163.0863 1171.8038 1176.8609 1200.4619 1237.1192 1267.6494 1288.3639 1313.4406 1323.7376 1342.1497 1377.5952 1407.1348 1424.3126 1436.7730 1473.1260 1482.6204 1507.5196 1535.0174 1578.1608 1589.3452 1605.9414 1613.3724 1623.6275 1640.5934 3121.4666 3122.3394 3135.7738 3142.6860 3149.1370 3155.9686 3163.7745 3171.4046 3176.5851 3502.6360 3538.5954
redmass: 9.1463 4.3849 5.4781 6.2826 5.5160 5.2963 6.7377 6.1467 6.1274 6.0279 5.5424 8.3750 5.5709 6.6124 2.8608 3.9618 4.2373 4.0168 8.4243 2.9923 4.3733 2.7933 5.7861 6.0050 1.7902 1.7085 3.2411 5.9324 4.4689 4.9407 2.1018 3.6203 1.5932 1.8456 3.9575 6.2005 1.2456 1.5385 6.2854 1.9414 2.9624 1.3671 1.3789 5.6589 1.3329 1.3533 2.8366 2.2462 2.6763 1.6541 2.1753 3.0175 2.0490 1.0934 1.0555 1.1276 2.0076 2.5489 2.2560 2.6037 1.6782 2.1880 6.6300 7.8412 2.3005 2.2912 2.8049 2.3281 3.4900 10.7024 5.1194 4.6358 8.1307 6.1856 6.2927 9.1951 1.0884 1.0871 1.0879 1.0887 1.0932 1.0936 1.0976 1.1002 1.0987 1.0638 1.0772
irintensity: 1.4190 0.8756 1.2792 1.2788 3.2798 0.6211 0.8519 0.2485 0.5836 0.5299 1.1996 4.3512 3.1948 4.8242 0.2244 1.3024 0.5702 15.9061 1.4371 24.8884 56.1619 30.6657 10.0057 4.1874 33.9230 95.2607 10.1768 2.4871 10.5902 15.0205 32.2780 27.7965 120.7240 21.4958 9.0966 1.0943 4.0427 0.2105 8.8141 23.9780 7.1895 2.5264 5.0656 1.0478 0.7617 2.6200 53.1857 17.4602 198.8453 10.7910 29.2415 5.1352 35.2849 2.0843 0.0309 4.4121 2.8292 2.4013 2.6720 21.5609 20.0920 38.3889 0.8966 20.6272 30.2508 12.5233 75.2641 24.9370 180.6347 161.4708 59.5814 35.8672 121.7940 21.0631 146.0914 186.4784 6.6485 4.3735 2.2216 9.5538 22.3689 5.9101 18.8868 28.1823 12.8588 28.0310 46.6579
temp: 298.150 k
press: 1.00000 atm
elementType: 8 8 8 7 6 6 6 6 6 6 6 6 6 6 6 6 6 6 6 6 1 1 1 1 1 1 1 1 1 1 1
symmnumber: 1
zpe: 605004.4 jmol-1
zpe.correction: 0.230434 hartree
zpe.thermalcorrener: 0.246308 hartree
zpe.thermalcorrenthalpy: 0.247252 hartree
zpe.thermalcorrgfe: 0.186271 hartree
zpe.sumelectzpe: -895.386262 hartree
zpe.sumelectthermal: -895.370388 hartree
zpe.sumelectthermalent: -895.369444 hartree
zpe.sumelectthermalfe: -895.430425 hartree
dipole: -1.7997 -6.6495 0.9026
dipole: 6.9476
quadrupole: -95.9016 -109.7869 -118.1671
quadrupole: -6.7174 -2.0196 2.3959
quadrupole: 12.0503 -1.8350 -10.2153 -6.7174 -2.0196 2.3959
hfenergy: -895.6166965 hartree
pointgroup: C01 [X(C16H11N1O3)]
dipole: -0.6665204 2.5281275 -0.7973657 debye
polarizability: 283.433408|-5.2555354|194.3362468|-12.5930101|-28.2603832|110.569093 unknown
InChI: InChI=1S/C16H11NO3/c18-15-11-8-4-5-9-12(11)17-14(13(15)16(19)20)10-6-2-1-3-7-10/h1-9,17,19H
charge 0 multiplicity 1
31 atoms
O  1.897247 -2.597782 0.47506
O  -0.863166 -3.096763 -0.75734
O  -1.621424 -2.56379 1.364786
N  0.446521 1.228848 -0.107894
C  -0.464087 0.191116 0.071444
C  1.836112 1.050501 -0.137783
C  2.362777 -0.261332 0.04136
C  0.010624 -1.110612 0.229923
C  1.454351 -1.418463 0.261788
C  -1.893954 0.617921 0.017502
C  2.703547 2.159556 -0.332071
C  3.769547 -0.445014 0.014385
C  -2.829229 0.22141 1.010535
C  -2.319078 1.487379 -1.026701
C  4.092443 1.951877 -0.353406
C  4.631435 0.646007 -0.181975
C  -0.906176 -2.284652 0.374235
C  -4.159597 0.689854 0.955417
C  -3.651742 1.947774 -1.078697
C  -4.576344 1.552678 -0.084147
H  0.072988 2.178325 -0.170145
H  2.289856 3.166712 -0.464575
H  4.1445 -1.46394 0.156034
H  -2.513021 -0.44489 1.817743
H  -1.619317 1.764584 -1.82466
H  4.76397 2.804208 -0.503484
H  5.715826 0.497439 -0.200463
H  -4.870112 0.380043 1.729085
H  -3.969747 2.602571 -1.897223
H  -5.611003 1.910651 -0.121849
H  -1.385346 -3.927517 -0.583587
