program: Gaussian 09
title: 000291881
version: EM64L-G09RevD.01
frameworkgroup: C1[X(C21H32O4)]
method: RPBEPBE
basis: SDD
operation: Freq
keyword: #pfreq=noraman
keyword: PBEPBE/SDD
title: #p freq=noraman PBEPBE/SDD
converged: YES YES NO NO
title: Mulliken charges:
elementType: O O O O C C C C C C C C C C C C C C C C C C C C C H H H H H H H H H H H H H H H H H H H H H H H H H H H H H H H H
charge: -0.257066 -0.267343 -0.244440 -0.238149 -0.384416 -0.384382 -0.384863 -0.381548 -0.369601 -0.375488 -0.379803 -0.407468 -0.512538 -0.320588 0.242358 0.365563 -0.349486 -0.393404 -0.262771 0.300113 -0.357050 -0.317990 -0.664871 0.119390 -0.792384 0.194705 0.194111 0.194530 0.195470 0.195541 0.197566 0.196772 0.197166 0.190857 0.192454 0.193029 0.193965 0.226521 0.207857 0.216957 0.217385 0.238469 0.246532 0.212264 0.212666 0.253790 0.253099 0.222353 0.233235 0.275919 0.242613 0.216926 0.248992 0.226410 0.259055 0.235152 0.235864
chargesum: 0.00000
title: Mulliken charges with hydrogens summed into heavy atoms:
elementType: O O O O C C C C C C C C C C C C C C C C C C C C C
charge: -0.257066 -0.267343 -0.244440 -0.238149 0.004400 0.005618 0.008243 0.012389 0.013710 0.011505 0.054575 0.026875 -0.027537 0.104342 0.242358 0.365563 -0.095696 -0.140305 0.192817 0.300113 -0.081131 -0.075377 0.027458 0.119390 -0.062312
polarizability: 3.87648752e+02 -1.23159198e+01 2.18822393e+02 -5.05096015e-01 -5.92749630e-01 1.55754151e+02
1716.lowfreq: -1.3371 -0.0019 0.0012 0.0019 3.4062 8.8713 12.4884 16.7922 17.4858
frequency: 10.5684 12.7964 17.4626 21.6877 35.2215 40.2800 53.4740 63.0316 67.1824 75.2974 84.9502 90.8749 95.6467 107.0598 118.4091 123.9269 136.6887 146.3451 147.9704 150.1861 157.7427 163.4692 188.3893 213.3432 230.8501 251.0127 284.7392 300.5002 325.2983 338.9989 373.5862 404.4084 415.4708 420.2081 457.9151 477.4108 493.2952 497.5039 520.2383 564.9280 565.8915 590.2870 628.2697 661.5459 687.0230 723.6961 726.1713 737.1791 737.4658 761.5792 784.8108 798.4196 804.4511 816.5069 826.6827 839.3241 850.2983 891.8199 904.1938 945.4705 957.8385 962.8198 965.0950 986.5669 990.4264 993.4077 998.3447 1012.9701 1020.5923 1025.2376 1038.7050 1043.3075 1072.0898 1074.5221 1075.5407 1081.3815 1085.7292 1094.8664 1100.7500 1110.1905 1120.2575 1139.9372 1149.1487 1156.7595 1173.6457 1195.5648 1206.5781 1224.7696 1233.0203 1239.9900 1254.2394 1268.8954 1278.5039 1279.3641 1279.8933 1280.6339 1288.7813 1292.3441 1298.9740 1300.9107 1302.6468 1303.8616 1325.5691 1345.6746 1355.0580 1357.5824 1360.0987 1364.5582 1365.5585 1373.1288 1384.0094 1390.7038 1429.8189 1442.3671 1448.4619 1457.7481 1461.6769 1462.4280 1463.8190 1464.2625 1465.3096 1467.8177 1470.5589 1476.0701 1481.9930 1485.0754 1487.4649 1490.6972 1500.2004 1561.6252 1589.3761 1622.2710 1641.1933 2950.6464 2951.8489 2952.6681 2953.9261 2956.2275 2961.5635 2967.1854 2978.0335 2984.2899 2985.4242 2989.8806 2991.9433 2992.0952 2995.1388 2997.2447 3009.3422 3012.9441 3026.2747 3028.4913 3038.8146 3044.0181 3064.3949 3066.0120 3068.8178 3086.7032 3091.8627 3117.9883 3124.0968 3142.9386 3146.9382 3167.2794 3170.6580
redmass: 4.1182 4.8301 5.0000 4.3131 4.0471 3.8767 2.2613 3.1415 3.5403 3.5061 2.0257 3.7357 3.9378 3.5381 2.2722 3.0461 3.0536 1.9950 3.2884 1.0719 2.1236 2.3339 3.0576 1.7889 3.3240 2.7448 5.9773 2.8546 4.1896 4.3152 3.5180 3.8311 2.9764 3.7042 3.7664 3.3383 3.0435 3.4398 3.7332 3.0974 4.5200 2.3102 7.0202 4.0296 5.1328 1.0610 1.0841 2.9748 1.1968 1.1649 2.0891 1.2179 6.4812 1.6500 1.2572 1.5399 1.3185 3.6643 1.2804 2.1906 7.7514 1.3391 1.2427 1.3472 4.8119 4.7925 2.8582 3.0021 1.1453 1.8174 4.2004 3.5353 2.4412 2.7355 2.6582 2.1438 2.3989 2.2136 1.7624 3.6220 1.3102 2.4245 1.3915 1.6712 1.2343 1.6094 1.2729 1.4063 3.1050 1.3334 1.2972 1.3106 1.2212 1.1168 3.0572 1.0332 1.0705 1.1329 1.2053 1.1400 1.1768 1.3833 1.3941 1.4010 1.3779 1.7096 1.5683 1.7314 1.6475 2.0203 1.6567 1.2337 4.4009 1.0854 1.1040 1.0912 1.0725 1.0734 1.0500 1.0445 1.0679 1.0754 1.0964 1.1117 1.1204 1.0512 1.1243 1.1335 2.1354 6.9042 7.1641 6.7080 8.9853 1.0587 1.0579 1.0569 1.0592 1.0583 1.0594 1.0586 1.0651 1.0374 1.0961 1.0890 1.0705 1.0366 1.0592 1.0988 1.1027 1.1063 1.1045 1.0595 1.1015 1.1007 1.1053 1.1007 1.0970 1.0974 1.1031 1.1059 1.0991 1.0881 1.0881 1.0952 1.0964
irintensity: 0.0690 0.0704 0.2452 0.0113 0.8182 0.6826 0.0392 0.8796 3.9269 2.3949 0.1383 0.1199 0.4454 0.0507 0.7982 1.9406 0.9698 3.8566 1.4643 0.1342 0.4205 2.3787 4.2907 2.4410 1.4628 2.0556 1.0352 9.1926 2.5087 8.6006 2.0099 0.5945 0.0978 3.6273 2.3681 0.4630 6.5417 1.4607 0.4442 8.7325 42.4295 14.4623 2.4622 5.9833 4.6600 18.2459 0.0924 0.0458 7.0554 0.4031 8.0787 5.6650 10.7742 3.3948 1.9329 59.3562 18.1604 14.1399 0.1356 55.7781 76.1994 0.1043 0.6570 1.9897 12.3476 6.2813 2.7326 69.7306 2.4982 1.2949 11.9157 0.4167 8.8690 11.7307 54.5820 0.1197 6.5595 62.8646 56.0596 0.2362 14.4618 172.9036 3.3876 11.8675 221.8705 0.5556 73.8441 0.3110 269.5330 2.0052 0.0936 33.0958 1.8778 3.3080 300.3576 0.0489 0.2766 0.1834 6.7782 1.2074 3.2490 37.9546 20.2960 7.9319 0.8231 0.0703 1.1544 16.4634 16.6398 61.0552 55.9204 22.7586 1.4111 21.7805 36.3243 12.0895 0.0175 0.1965 20.1188 13.9625 0.1552 1.4878 3.9432 10.6343 9.7734 12.3236 10.5809 42.3812 15.5198 68.3014 266.9003 142.9446 148.6285 2.7841 2.0756 13.3540 0.5647 15.2148 1.9175 173.4824 3.6350 4.1558 0.3484 11.7544 36.8034 17.5949 38.1963 1.7580 11.5764 11.7263 1.9196 32.2573 41.8070 91.3266 82.3698 88.4996 14.7665 37.5920 1.0007 35.1840 19.8797 8.5067 1.2731 16.1046 6.8202
temp: 298.150 k
press: 1.00000 atm
elementType: 8 8 8 8 6 6 6 6 6 6 6 6 6 6 6 6 6 6 6 6 6 6 6 6 6 1 1 1 1 1 1 1 1 1 1 1 1 1 1 1 1 1 1 1 1 1 1 1 1 1 1 1 1 1 1 1 1
symmnumber: 1
zpe: 1279564.2 jmol-1
zpe.correction: 0.487360 hartree
zpe.thermalcorrener: 0.516381 hartree
zpe.thermalcorrenthalpy: 0.517325 hartree
zpe.thermalcorrgfe: 0.420900 hartree
zpe.sumelectzpe: -1118.387641 hartree
zpe.sumelectthermal: -1118.358621 hartree
zpe.sumelectthermalent: -1118.357676 hartree
zpe.sumelectthermalfe: -1118.454101 hartree
dipole: 4.3911 -3.5124 -0.2415
dipole: 5.6282
quadrupole: -174.9853 -161.1521 -152.4086
quadrupole: 18.9834 -4.9900 -2.0523
quadrupole: -12.1366 1.6966 10.4401 18.9834 -4.9900 -2.0523
hfenergy: -1118.8750017 hartree
pointgroup: C01 [X(C21H32O4)]
dipole: 1.7194602 -1.3411975 0.3844386 debye
polarizability: 387.4994002|-12.7573926|211.2188297|3.8073447|-20.7423833|163.5070656 unknown
InChI: InChI=1S/C21H32O4/c1-3-24-21(23)12-10-8-6-4-5-7-9-11-17-25-20-15-13-19(14-16-20)18(2)22/h13-16H,3-12,17H2,1-2H3
charge 0 multiplicity 1
57 atoms
O  -4.500839 -0.920195 0.363439
O  10.56776 -0.623761 -0.42821
O  9.535381 1.460442 -0.226768
O  -10.203121 1.892603 -0.828427
C  3.068225 -0.705183 0.177772
C  1.756419 0.057855 -0.113438
C  4.335572 0.104569 -0.176848
C  0.48826 -0.752193 0.237026
C  5.648666 -0.657667 0.110243
C  -0.822049 0.011076 -0.060843
C  6.90815 0.160321 -0.249014
C  -2.08387 -0.809187 0.293711
C  8.210672 -0.618952 0.025905
C  -3.370719 -0.043609 -0.017352
C  9.461818 0.209586 -0.217601
C  -5.799578 -0.4502 0.166046
C  -6.122097 0.823405 -0.377486
C  -6.835048 -1.342692 0.55003
C  11.88858 0.053729 -0.618995
C  -8.52229 0.304957 -0.151922
C  -7.47225 1.184604 -0.529562
C  -8.177629 -0.966307 0.391415
C  12.547629 0.351497 0.730768
C  -9.938392 0.751206 -0.340848
C  -11.068195 -0.193343 0.065269
H  3.099335 -0.983953 1.251984
H  3.071269 -1.658579 -0.391046
H  1.727628 0.338306 -1.187275
H  1.752981 1.010366 0.456648
H  4.302821 0.384788 -1.250488
H  4.334046 1.057245 0.392543
H  0.493145 -1.705728 -0.33082
H  0.514471 -1.029301 1.311432
H  5.682618 -0.935045 1.185054
H  5.648794 -1.6117 -0.457728
H  -0.845452 0.286636 -1.136053
H  -0.82485 0.964956 0.506894
H  6.923803 1.105879 0.325046
H  6.87192 0.449724 -1.317838
H  -2.087918 -1.760768 -0.271552
H  -2.07454 -1.07288 1.368628
H  8.235297 -0.94899 1.085354
H  8.271882 -1.540501 -0.580936
H  -3.440458 0.197361 -1.098266
H  -3.425733 0.899938 0.564005
H  -5.337447 1.523561 -0.67785
H  -6.557076 -2.315895 0.96552
H  12.468167 -0.672193 -1.211542
H  11.727395 0.979374 -1.199241
H  -7.748547 2.159569 -0.945488
H  -8.96218 -1.668145 0.693149
H  13.556522 0.774599 0.568526
H  11.955501 1.086016 1.302059
H  12.652276 -0.569453 1.330139
H  -12.032753 0.289432 -0.152715
H  -11.008409 -1.148983 -0.488242
H  -11.019259 -0.4311 1.144489
