program: Gaussian 09
title: 000291850
version: EM64L-G09RevD.01
frameworkgroup: C1[X(C10H11BrN2O2)]
method: RPBEPBE
basis: SDD
operation: Freq
keyword: #p
keyword: freq=noraman
keyword: PBEPBE/SDD
title: #p freq=noraman PBEPBE/SDD
converged: YES YES NO NO
title: Mulliken charges:
elementType: Br O O N N C C C C C C C C C C H H H H H H H H H H H
charge: 0.017483 -0.214139 -0.242103 -0.157609 -0.001324 -0.458639 -0.456656 -0.392634 -0.387781 0.347520 0.254689 -0.332825 -0.280843 -0.195740 -0.238800 0.231458 0.236970 0.228254 0.235598 0.304194 0.229373 0.235164 0.238306 0.253467 0.294755 0.251863
chargesum: 0.00000
title: Mulliken charges with hydrogens summed into heavy atoms:
elementType: Br O O N N C C C C C C C C C C
charge: 0.017483 -0.214139 -0.242103 -0.157609 -0.001324 0.009789 0.007197 0.140933 0.085689 0.347520 0.254689 -0.079358 0.013912 0.056123 -0.238800
polarizability: 2.33256915e+02 -2.50301864e+00 1.59527540e+02 7.32862274e+00 -8.98179648e+00 7.96853669e+01
1716.lowfreq: -15.2157 -10.2229 -4.5435 -0.0007 -0.0007 -0.0004 31.2013 43.7740 78.5185
frequency: 30.5770 43.5197 78.5100 118.0784 126.4281 143.0634 193.3244 209.2397 225.4107 246.8216 263.4989 308.0024 351.8476 373.8131 437.9210 490.3789 516.8600 574.3553 581.8947 637.4171 664.7500 679.5226 719.5829 743.7715 789.5705 815.6781 857.7740 863.5637 901.4858 921.4245 927.4513 942.3023 949.4152 1004.9371 1062.6445 1081.2963 1087.4534 1108.6119 1120.8567 1168.1841 1171.7891 1174.9482 1195.5999 1229.4284 1248.6106 1262.9415 1308.8525 1319.9134 1323.1591 1332.2814 1352.0082 1356.9670 1369.1096 1419.0085 1469.5418 1471.7595 1483.7856 1487.7699 1500.7641 1537.4017 1604.7868 2955.3067 2969.6281 3012.4507 3016.0807 3036.4425 3040.9959 3083.6827 3096.5156 3161.7732 3182.7608 3188.6131
redmass: 3.6847 3.8026 4.2079 5.1886 8.5596 5.0427 5.2619 3.3492 2.2465 5.5012 5.0746 6.3061 8.1926 5.0344 5.2673 4.5856 3.8793 2.1904 4.0350 7.4285 6.5837 7.5706 4.2145 2.8849 1.6613 7.1043 1.6302 1.8442 1.4206 1.4200 2.8185 2.3054 1.9760 1.8037 4.3791 1.6921 2.5450 1.6099 3.9566 1.6412 1.5146 1.4230 3.5284 1.3058 1.2373 1.4216 1.6598 1.2603 1.8131 1.8626 2.5841 2.4021 3.0292 4.2975 1.0930 1.2290 1.8604 1.1048 1.2965 8.5932 6.8686 1.0660 1.0619 1.0684 1.0645 1.0972 1.0939 1.1003 1.1049 1.0892 1.0923 1.0947
irintensity: 0.0952 0.7395 0.5087 2.3252 0.0700 0.9156 1.5403 4.7540 0.4929 2.6505 3.2406 8.4113 0.8099 1.0107 4.5592 4.2054 14.1494 2.1641 10.4343 2.7938 7.7178 32.3446 5.9108 2.2406 39.8273 36.1409 13.4798 2.9402 16.2951 0.1049 4.9997 0.8136 1.9653 9.3693 16.9809 1.9244 9.6169 2.1113 28.1259 15.0411 25.3977 14.5913 326.7575 45.1346 0.6850 16.6026 38.3930 1.0827 17.0801 44.7012 54.4576 47.4075 18.7756 5.1764 20.5014 149.3998 178.8999 1.4314 43.0267 65.4499 48.0553 35.8589 39.6328 21.4157 25.7397 35.4115 9.5514 28.4867 43.6982 2.0925 2.6335 9.9819
temp: 298.150 k
press: 1.00000 atm
elementType: 35 8 8 7 7 6 6 6 6 6 6 6 6 6 6 1 1 1 1 1 1 1 1 1 1 1
symmnumber: 1
zpe: 518736.2 jmol-1
zpe.correction: 0.197576 hartree
zpe.thermalcorrener: 0.211220 hartree
zpe.thermalcorrenthalpy: 0.212164 hartree
zpe.thermalcorrgfe: 0.155121 hartree
zpe.sumelectzpe: -659.874557 hartree
zpe.sumelectthermal: -659.860914 hartree
zpe.sumelectthermalent: -659.859969 hartree
zpe.sumelectthermalfe: -659.917012 hartree
dipole: 4.0292 -5.8072 -0.4909
dipole: 7.0851
quadrupole: -84.7765 -103.6845 -100.0237
quadrupole: -8.8330 -3.8725 -2.4877
quadrupole: 11.3851 -7.5229 -3.8622 -8.8330 -3.8725 -2.4877
hfenergy: -660.0721334 hartree
pointgroup: C01 [X(C10H11Br1N2O2)]
dipole: 1.6973276 1.7438351 -1.3594938 debye
dipolederiv: -0.7316077 0.1519114 0.039498 0.1049422 -0.0647919 0.0099456 0.0784782 -0.0159154 -0.0383504 -0.3323571 -0.0835929 0.2558416 0.0398155 -0.5152779 0.256214 0.2673916 0.3663307 -0.8992939 -0.440557 0.4543241 -0.0274301 0.3127867 -0.7103329 0.03358 0.0713162 -0.1041821 -0.4145221 -1.6682111 -0.1752461 0.1817274 -0.0075254 -0.2448408 0.0488722 0.2196172 0.1025039 -0.3884273 0.3427015 -0.5244474 -0.1745449 -0.404825 1.318308 -0.5540597 -0.3234353 -0.5346187 1.2651697 0.0565758 -0.0262433 0.027096 -0.0657134 0.0893899 0.0471827 -0.0479943 0.0620341 0.112221 0.0253297 0.0189348 -0.0618613 0.0430439 0.0728698 0.037036 0.0259206 0.0848159 0.0851051 0.3651582 -0.0591953 0.1351694 -0.1860886 0.1410392 0.0146754 0.1626479 -0.0291621 0.3521908 0.3102835 0.101604 -0.1963266 0.2903244 0.3344997 -0.0850859 -0.3449704 -0.0898905 0.4076212 1.586824 0.1791256 -0.1458014 0.0392997 0.0203852 0.1233143 0.0580796 -0.0269154 0.1036887 -0.211142 0.3429551 -0.2715783 -0.1384524 -0.4926502 0.3213243 0.1391746 0.2671852 -0.3040588 -0.5240141 -0.1609109 0.1085074 0.1744089 -0.0768153 -0.161602 -0.2801924 -0.1552023 -0.0156237 -0.1786662 -0.2435182 0.2857382 0.0142345 0.1699734 -0.1853564 0.0139104 0.0204163 -0.0315192 -0.0244803 0.2332722 -0.1529434 0.125587 0.0682374 -0.1703931 -0.0891464 -0.2153087 0.1815257 1.1853507 -0.2396121 -0.1724693 -0.2812471 -0.2955439 0.1694776 -0.092475 0.227659 -0.3141684 0.0527091 0.0228217 0.033519 0.0486118 -0.0573259 -0.0757635 0.109011 -0.0936745 -0.032478 -0.074112 0.0041115 -0.091942 -0.0009765 0.0826878 0.0000979 -0.1528098 0.0110962 -0.0221705 0.0614045 0.0262069 -0.0030334 -0.0084696 -0.0687608 -0.0844218 -0.0604929 -0.1293018 -0.0205489 -0.0610861 -0.0581055 0.1056012 -0.062121 0.0636721 0.0401595 0.1424675 0.0629588 -0.0334632 0.0930113 -0.0906551 0.0387084 0.0202658 -0.0505454 0.0628028 -0.0209303 0.0290673 0.0484355 -0.0647321 -0.0062069 0.0720691 0.0171025 0.0229071 -0.0603029 -0.0795418 -0.0517024 -0.1137779 0.0155997 0.1257919 -0.0317697 0.0020049 -0.1029186 0.054948 0.0404897 0.0210868 0.0308225 0.0134832 -0.0251116 0.0038349 -0.077253 0.0033202 -0.0590448 0.0968647 -0.0036856 -0.1770161 0.0091013 -0.030138 0.091679 -0.0514666 0.0972907 0.088985 0.0380662 0.083323 0.0436564 0.1227159 0.0061349 -0.0008343 -0.0127514 0.1145017 0.050207 0.0679203 0.0314427 0.1123337 0.0707175 0.0557895 -0.0484549 0.0644619 0.0807215 0.0772078 -0.0393671 0.0796398 0.0626483 unknown
polarizability: 230.0302736|-15.9782352|121.7569198|-17.4310738|-39.1638309|120.6826286 unknown
InChI: InChI=1S/C10H11BrN2O2/c11-8-3-4-9(10(7-8)13(14)15)12-5-1-2-6-12/h3-4,7H,1-2,5-6H2
charge 0 multiplicity 1
26 atoms
Br -4.717938 0.978593 0.373393
O  -0.719966 -1.907651 2.645927
O  0.604634 -2.442955 0.860726
N  1.42215 0.339253 -0.271107
N  -0.238945 -1.655392 1.467684
C  3.773349 0.07603 0.110149
C  3.540699 1.426951 -0.6041
C  2.385106 -0.291165 0.673101
C  2.11875 1.287997 -1.191738
C  0.041731 0.282978 -0.206515
C  -0.740752 -0.49025 0.736553
C  -0.734366 1.13015 -1.080329
C  -2.126217 -0.243841 0.936567
C  -2.111435 1.321338 -0.927127
C  -2.800807 0.665613 0.122101
H  4.095534 -0.691978 -0.616218
H  4.53544 0.134075 0.904483
H  3.564032 2.25482 0.127642
H  4.289938 1.638503 -1.384807
H  2.230324 -1.381743 0.721761
H  2.224848 0.114802 1.69454
H  1.599398 2.263154 -1.21361
H  2.134726 0.881629 -2.223088
H  -0.237485 1.651597 -1.900338
H  -2.639804 -0.822972 1.707892
H  -2.647244 1.981463 -1.615341
