program: Gaussian 09
title: 000291818
version: EM64L-G09RevD.01
frameworkgroup: C1[X(C9H11NOS)]
method: RPBEPBE
basis: SDD
operation: Freq
keyword: #p
keyword: freq=noraman
keyword: PBEPBE/SDD
title: #p freq=noraman PBEPBE/SDD
converged: YES YES NO NO
title: Mulliken charges:
elementType: S O N C C C C C C C C C H H H H H H H H H H H
charge: 0.200899 -0.253144 -0.448405 0.498421 -0.398170 -0.150621 -0.372719 -0.265211 -0.198874 0.210751 -0.800704 -0.869161 0.225276 0.311125 0.243129 0.306466 0.228648 0.236414 0.269996 0.235965 0.261428 0.262549 0.265944
chargesum: 0.00000
title: Mulliken charges with hydrogens summed into heavy atoms:
elementType: S O N C C C C C C C C C
charge: 0.200899 -0.253144 -0.141939 0.498421 -0.172894 -0.150621 -0.061594 -0.022082 0.029773 0.210751 -0.058329 -0.079240
polarizability: 1.87843787e+02 -4.26118851e+00 1.40615319e+02 -1.38389405e-01 1.32574975e-02 5.85390952e+01
1716.lowfreq: -69.1778 -15.0195 -0.0025 -0.0025 -0.0016 1.9195 6.0774 28.0140 55.0473
frequency: -69.1670 26.3449 55.0310 88.1516 114.5795 168.7484 189.4612 226.5626 252.9386 281.2657 319.9937 352.1203 426.6176 436.9591 521.2281 556.1037 590.4307 642.5055 643.1598 673.4451 690.9206 705.5636 796.4688 841.5825 850.5656 912.3602 941.4489 964.9552 978.2475 986.1713 990.4602 995.5466 1030.8401 1082.8850 1102.6669 1183.6730 1218.1270 1256.2435 1308.4492 1346.1988 1375.4953 1380.5412 1397.4615 1450.1054 1452.7326 1459.3439 1468.9460 1474.7251 1511.7413 1592.4436 1602.8766 1636.4437 2987.2519 3003.3368 3072.5755 3118.2798 3123.5317 3132.7227 3135.6686 3136.8041 3157.6161 3202.1914 3522.1249
redmass: 1.0654 3.5040 7.6332 3.2650 3.9972 2.5903 4.3866 1.4014 3.0658 5.4632 4.1246 5.2447 6.6565 2.9880 4.2385 3.4897 2.9380 5.3630 1.3717 6.9888 2.1346 6.5462 1.3610 4.4459 1.6235 1.3779 5.2983 1.1794 4.4801 1.4495 1.3141 1.6855 1.6576 2.0005 1.6306 1.0932 3.3448 1.7615 1.4484 1.1679 1.2651 3.7898 3.4670 1.1218 1.0529 1.2109 1.0469 1.9213 2.0104 5.4065 6.0429 5.1779 1.0384 1.0293 1.0984 1.1062 1.0908 1.1008 1.0872 1.0978 1.0965 1.0950 1.0762
irintensity: 0.0134 0.2464 9.1068 3.8111 1.3574 0.3905 7.0130 0.0589 1.8938 1.6796 1.4046 1.8438 1.2857 6.2730 19.6852 4.7026 1.9970 4.8866 59.8667 0.4707 28.2971 7.5792 52.8007 10.8346 35.9637 7.9920 3.9357 9.6958 4.2786 34.1384 4.7502 13.4337 7.9546 19.9453 19.8344 6.6569 67.0023 23.0919 46.2055 13.1019 27.6639 168.9690 25.0721 56.9746 15.3044 87.8197 20.1273 90.1866 221.3418 86.7965 168.7198 129.1593 8.8046 24.4114 16.0133 20.5540 10.4908 10.6872 6.8437 7.6957 14.1670 7.3683 9.6800
temp: 298.150 k
press: 1.00000 atm
elementType: 16 8 7 6 6 6 6 6 6 6 6 6 1 1 1 1 1 1 1 1 1 1 1
symmnumber: 1
zpe: 473386.1 jmol-1
zpe.correction: 0.180303 hartree
zpe.thermalcorrener: 0.192170 hartree
zpe.thermalcorrenthalpy: 0.193114 hartree
zpe.thermalcorrgfe: 0.140858 hartree
zpe.sumelectzpe: -876.720707 hartree
zpe.sumelectthermal: -876.708840 hartree
zpe.sumelectthermalent: -876.707896 hartree
zpe.sumelectthermalfe: -876.760153 hartree
dipole: 0.7204 -4.8041 0.0106
dipole: 4.8578
quadrupole: -85.5485 -65.5530 -82.9527
quadrupole: 7.2278 0.1786 -0.0179
quadrupole: -7.5305 12.4651 -4.9346 7.2278 0.1786 -0.0179
hfenergy: -876.9010104 hartree
pointgroup: C01 [X(C9H11N1O1S1)]
dipole: 0.2626625 -1.8853752 0.170732 debye
dipolederiv: -0.4072231 0.3156324 -0.0500016 0.2536219 -0.133869 0.0185253 -0.0374123 0.0211928 -0.0983935 -0.9356598 0.0077445 -0.0438953 0.5552598 -0.7183102 0.0675934 -0.0840872 0.0275493 -0.3476188 -1.8987157 -0.3087668 -0.0915963 -0.2557022 -0.3837507 -0.0138576 -0.096511 -0.017257 -0.3301133 0.9442521 0.2905363 0.0378576 0.6840798 0.4350697 0.0255822 0.0090217 -0.0031815 0.119102 -0.6469756 0.0150656 -0.0336791 0.0330458 -0.0570521 -0.0082741 -0.0312958 -0.0107326 -0.2086033 0.9099022 -0.4065068 0.1016243 -0.5398362 0.2232612 -0.0562049 0.1088403 -0.0468385 -0.0387785 -0.2862988 0.0079042 -0.0077617 -0.2944252 -0.2642162 -0.0159418 0.0151785 0.005346 -0.1956047 -0.3793249 0.1991501 -0.031091 0.2911455 -0.2123241 0.0245036 -0.0393055 0.018997 -0.1675434 0.3052348 -0.0580278 0.0350859 0.0586197 0.1872054 -0.019167 0.0266127 -0.0279666 -0.1287846 2.1358883 0.1637392 0.1319618 -0.5045029 0.9248543 -0.0909472 0.1824332 -0.0419982 0.1822422 -0.2144649 -0.1668744 -0.0077618 -0.3084402 -0.2996302 0.0029801 0.0013424 0.0124072 0.0595343 -0.0888801 -0.0019318 -0.0099211 -0.0073152 0.1566065 -0.0067678 -0.0139174 -0.0039707 0.0774336 0.1020388 -0.0233193 -0.0018196 -0.0274021 -0.1061078 0.0173361 -0.0014614 0.0172936 0.1566405 0.106167 0.0649552 -0.0105101 0.0441226 0.1204411 0.0083797 -0.0089429 0.0099459 0.1886253 -0.033708 -0.0963106 -0.0072652 -0.070736 0.0646325 0.0022044 -0.009913 0.0011396 0.1680526 0.1661246 0.0497496 -0.0130911 -0.0041628 0.0833826 0.0153775 -0.0093237 0.0191765 0.2945822 0.0708437 0.0243301 -0.0077169 0.0087913 -0.1226077 0.021133 -0.0060835 0.0220908 0.1502152 0.0581793 0.0289816 0.0753728 -0.0168743 0.006805 -0.089522 0.0297642 -0.1110697 -0.0124898 -0.0672047 0.0118385 -0.0145938 0.0774699 0.0837182 0.0087357 -0.018872 0.0044613 0.1296827 0.0711517 0.0042464 -0.064442 -0.0316384 0.0335538 0.078972 -0.0126727 0.1065042 -0.0524835 0.0850317 -0.1157208 -0.0905813 -0.023242 -0.0406305 -0.0504493 -0.0697414 -0.0511854 -0.0432488 0.0573633 -0.1008496 0.1266701 -0.0140175 -0.0225727 0.0446411 0.0891815 0.0329909 -0.0319408 -0.053722 0.0944339 -0.0228445 0.0921388 0.0415409 0.0151674 -0.0228347 0.015105 0.1294925 unknown
polarizability: 187.0862103|-4.0085612|140.1633825|9.5764859|-6.6581|59.7486081 unknown
InChI: InChI=1S/C9H11NOS/c1-7(11)10-8-4-3-5-9(6-8)12-2/h3-6,10H,1-2H3
charge 0 multiplicity 1
23 atoms
S  3.742097 -0.33582 0.380851
O  -3.328238 0.750565 -0.202041
N  -1.525196 -0.739124 0.038322
C  -0.401919 0.13875 0.053588
C  0.88043 -0.463624 0.188978
C  2.04151 0.334944 0.211374
C  -0.520319 1.547202 -0.059758
C  1.932732 1.745454 0.097744
C  0.65659 2.328422 -0.035677
C  -2.883758 -0.427552 -0.084496
C  -3.795574 -1.656741 -0.062761
C  3.446572 -2.180639 0.536354
H  0.950073 -1.554785 0.274091
H  -1.506964 1.999967 -0.162763
H  2.830862 2.371896 0.114842
H  -1.303126 -1.733759 0.127468
H  0.573592 3.417416 -0.122384
H  -3.566112 -2.34246 -0.899548
H  -4.83736 -1.319621 -0.158901
H  -3.690701 -2.219727 0.883345
H  2.974164 -2.581384 -0.374565
H  2.838686 -2.40548 1.427116
H  4.446257 -2.6263 0.654522
