program: Gaussian 09
title: 000291838
version: EM64L-G09RevD.01
frameworkgroup: C1[X(C14H10N4O6S)]
method: RPBEPBE
basis: SDD
operation: Freq
keyword: #p
keyword: freq=noraman
keyword: PBEPBE/SDD
title: #p freq=noraman PBEPBE/SDD
converged: YES YES NO NO
title: Mulliken charges:
elementType: S O O O O O O N N N N C C C C C C C C C C C C C C H H H H H H H H H H
charge: 0.988252 -0.130522 -0.566239 -0.495343 -0.495368 -0.207426 -0.203159 -0.245001 -0.053550 0.004965 0.031168 0.128292 -0.663524 0.363056 0.184619 -0.344001 -0.058168 -0.348531 0.178870 -0.234611 -0.215870 -0.278420 -0.251830 0.363107 -0.413204 0.291353 0.290622 0.311017 0.249944 0.292302 0.251295 0.290887 0.297421 0.300078 0.387521
chargesum: 0.00000
title: Mulliken charges with hydrogens summed into heavy atoms:
elementType: S O O O O O O N N N N C C C C C C C C C C C C C C
charge: 0.988252 -0.130522 -0.178718 -0.495343 -0.495368 -0.207426 -0.203159 -0.245001 -0.053550 0.004965 0.031168 0.128292 -0.081550 0.363056 0.184619 -0.032984 -0.058168 -0.098588 0.178870 0.057692 0.035425 0.012467 0.045591 0.363107 -0.113126
polarizability: 4.36298321e+02 3.74576669e+01 2.74665219e+02 -3.02862151e+00 2.64923869e+00 1.06263502e+02
1716.lowfreq: -2.0294 -0.0008 0.0013 0.0015 1.9175 3.2089 16.3143 19.9335 28.8914
frequency: 16.3027 19.8871 28.8772 33.6454 46.0896 61.0842 81.3245 93.8638 104.3947 135.9522 148.4593 175.0525 185.6177 202.7976 217.9133 225.4774 234.1624 268.5838 278.2693 301.4726 328.9946 344.1362 355.4929 383.7219 411.3165 413.9224 428.5946 439.1445 460.3355 502.5352 504.5767 506.9846 540.9332 582.9251 588.0113 606.0230 618.0964 633.1674 669.3496 676.1232 692.4856 701.5372 753.6873 768.4126 792.1116 809.0655 836.4825 866.4008 871.8330 924.4522 935.2551 942.9119 950.5810 951.0022 968.7458 977.8744 978.7836 999.3880 1007.0090 1027.6987 1048.5223 1058.3961 1070.9847 1089.2629 1099.5850 1122.1073 1123.8998 1138.8403 1183.5054 1214.5335 1221.5728 1277.2458 1287.9841 1312.3674 1338.6276 1357.9870 1365.9501 1384.6323 1395.0571 1407.5691 1430.5844 1448.0672 1480.1531 1529.7368 1557.0760 1568.8210 1577.3499 1612.8155 1689.9248 3017.8152 3072.7493 3144.9949 3161.3025 3164.2829 3172.6978 3177.7723 3181.9689 3206.7442 3479.9142
redmass: 6.1975 8.7928 8.3761 11.8723 9.6331 8.3385 5.5277 10.0358 5.6751 3.8585 9.2806 2.3876 3.0926 5.3760 5.8412 10.4105 5.2622 3.7830 6.9657 5.9662 9.6289 8.7643 5.1278 9.1755 6.8470 3.8691 9.5799 3.0767 2.8381 4.0198 6.1149 7.4530 8.6137 5.4563 4.9544 5.0354 7.8088 7.5516 9.1797 6.7195 2.1937 8.0945 9.1264 5.4926 9.5306 1.4457 13.0068 1.4722 6.6918 1.7655 1.4363 5.9059 1.4730 1.8651 13.3584 5.8785 3.8735 1.3692 1.3306 5.9527 1.6399 2.3973 1.8128 2.0921 2.3269 3.3682 1.1838 1.5306 1.1023 9.2157 1.5800 1.4991 1.3244 3.8041 4.7426 6.2207 4.5611 7.1297 3.5678 1.2339 2.5102 2.9171 3.8726 7.2117 7.4197 6.7983 6.8526 6.7677 12.7389 1.0615 1.1000 1.0883 1.0916 1.0927 1.0930 1.0995 1.0913 1.0965 1.0662
irintensity: 1.3551 0.6300 1.2177 0.6330 0.6633 0.4964 0.4680 0.1863 3.3163 13.2490 4.1580 22.4391 14.6737 20.7193 1.9353 4.8661 5.3682 37.6363 0.7242 53.5042 7.9971 0.6813 0.2373 4.9650 9.3663 5.0537 70.7555 2.1307 6.4996 14.0731 3.3581 26.0894 119.0084 32.4564 5.4615 7.9869 2.0197 19.8443 10.6854 12.2147 29.1798 10.5066 38.3170 5.1919 15.9671 48.8242 55.5327 41.1900 70.3134 5.8405 8.1212 22.2975 9.3998 6.4715 77.8652 15.3710 4.0423 0.1539 0.4831 70.7007 80.4160 28.6217 54.5699 38.9767 15.5357 60.7158 2.7559 68.0703 4.8773 787.8111 2.7934 42.6124 4.8726 119.7927 48.7266 15.0187 174.0199 25.8844 140.5982 11.5639 24.9458 300.8989 1.4659 5.4050 65.5206 9.2827 354.6112 6.5741 323.6583 1.0859 0.0015 8.8266 8.1888 4.8364 0.8546 8.9941 1.7576 0.4068 51.6174
temp: 298.150 k
press: 1.00000 atm
elementType: 16 8 8 8 8 8 8 7 7 7 7 6 6 6 6 6 6 6 6 6 6 6 6 6 6 1 1 1 1 1 1 1 1 1 1
symmnumber: 1
zpe: 602814.6 jmol-1
zpe.correction: 0.229600 hartree
zpe.thermalcorrener: 0.252157 hartree
zpe.thermalcorrenthalpy: 0.253101 hartree
zpe.thermalcorrgfe: 0.174049 hartree
zpe.sumelectzpe: -1605.846883 hartree
zpe.sumelectthermal: -1605.824326 hartree
zpe.sumelectthermalent: -1605.823382 hartree
zpe.sumelectthermalfe: -1605.902434 hartree
dipole: 7.0779 4.7202 1.2690
dipole: 8.6016
quadrupole: -197.4992 -153.2697 -151.7037
quadrupole: 13.4936 8.6613 -8.3853
quadrupole: -30.0083 14.2212 15.7871 13.4936 8.6613 -8.3853
hfenergy: -1606.0764829 hartree
pointgroup: C01 [X(C14H10N4O6S1)]
dipole: -2.8643821 1.7327591 -0.4951614 debye
polarizability: 439.4458278|-29.7758313|271.5922223|-1.0657383|-0.75182|106.1889926 unknown
InChI: InChI=1S/C14H10N4O6S/c19-14-7-12(9-2-1-3-11(6-9)25(22,23)24)16-17(14)13-5-4-10(8-15-13)18(20)21/h1-6,8,22H,7H2
charge 0 multiplicity 1
35 atoms
S  -4.6414 -2.304312 0.038798
O  1.957214 3.629292 0.010126
O  -4.730299 -2.468479 -1.807978
O  -3.414423 -3.2033 0.586763
O  -6.130033 -2.472699 0.647745
O  5.882129 -3.000539 0.07344
O  7.054813 -1.042799 -0.060393
N  1.206486 1.323262 0.002667
N  -0.043958 0.65449 0.014226
N  3.562755 1.191158 -0.070607
N  5.951102 -1.71091 0.007108
C  -1.0053 1.572281 0.012632
C  -0.461126 2.980541 0.003357
C  -2.422088 1.190105 0.018598
C  1.064041 2.766784 0.003321
C  -2.794535 -0.184645 0.009349
C  -4.155809 -0.489169 0.019451
C  -3.442328 2.180896 0.031791
C  2.375869 0.524467 0.005649
C  -5.18984 0.46345 0.037926
C  -4.807471 1.823418 0.045368
C  2.267763 -0.89512 0.083207
C  3.452784 -1.644347 0.08421
C  4.685943 -0.954605 0.0085
C  4.702801 0.457344 -0.06753
H  -0.758579 3.560041 -0.889233
H  -0.755116 3.571432 0.889483
H  -2.030936 -0.968561 0.007514
H  -3.169049 3.241537 0.037619
H  -6.238963 0.153618 0.060459
H  -5.576886 2.6011 0.059938
H  1.287848 -1.369929 0.140584
H  3.444791 -2.735696 0.142889
H  5.648996 1.002132 -0.128912
H  -5.002897 -3.408838 -2.019568
