program: Gaussian 09
title: 000291815
version: EM64L-G09RevD.01
frameworkgroup: C1[X(C14H9NO2S)]
method: RPBEPBE
basis: SDD
operation: Freq
keyword: #p
keyword: freq=noraman
keyword: PBEPBE/SDD
title: #p freq=noraman PBEPBE/SDD
converged: NO YES NO NO
title: Mulliken charges:
elementType: S O O N C C C C C C C C C C C C C C H H H H H H H H H
charge: 0.264313 -0.273563 -0.170938 -0.093112 0.290786 0.116849 0.113230 -0.273382 -0.096230 -0.367388 -0.328419 0.090911 -0.292400 -0.221605 -0.228044 -0.227095 -0.141950 -0.507937 0.269554 0.261546 0.274056 0.311599 0.233575 0.235091 0.234996 0.252744 0.272814
chargesum: 0.00000
title: Mulliken charges with hydrogens summed into heavy atoms:
elementType: S O O N C C C C C C C C C C C C C C
charge: 0.264313 -0.273563 -0.170938 -0.093112 0.290786 0.116849 0.113230 -0.003828 -0.096230 -0.105842 -0.054363 0.090911 0.019199 0.011970 0.007047 0.007901 0.110794 -0.235123
polarizability: 4.16268678e+02 -2.34234970e+01 2.18488756e+02 -6.87409044e-03 -2.68134058e-02 6.62736899e+01
1716.lowfreq: -6.8771 -5.2072 -1.8272 -0.0009 0.0013 0.0013 37.7011 42.6241 51.6485
frequency: 37.6888 42.6111 51.6484 84.6175 97.0440 131.1480 186.7365 209.6778 212.2416 229.4378 287.7393 314.8684 401.0273 401.8411 432.5094 471.9759 533.9004 539.5492 592.1660 596.9878 611.5092 643.9214 663.2276 678.7253 694.0346 695.8866 713.5108 730.8424 732.2684 786.7823 790.8047 825.4933 840.6076 857.7453 860.7809 917.3352 924.4528 938.6807 947.3815 988.3202 992.5173 1006.9153 1017.3576 1037.4290 1050.0347 1081.8641 1089.1637 1110.6700 1174.9287 1179.8572 1187.2078 1247.9270 1271.7943 1320.2871 1357.4073 1367.9290 1388.5003 1437.5373 1447.0569 1464.8031 1520.7150 1526.5397 1583.5201 1608.4709 1638.8329 1708.9901 3121.3563 3132.8504 3144.6023 3157.2139 3167.5869 3176.1295 3180.1789 3198.3929 3237.2563
redmass: 4.0599 6.3713 6.0666 7.9395 5.7160 5.7960 9.3246 6.0705 7.6491 11.3361 4.5409 7.3442 7.9221 2.8255 4.7367 4.1135 4.3916 10.1860 3.3681 10.2986 6.5514 10.3105 7.1985 6.7464 7.2674 1.6978 1.1733 9.1839 6.8466 1.9820 8.2928 4.8437 10.2590 1.2718 1.2511 1.4309 8.0429 1.3810 1.4207 6.2439 1.3861 1.3331 3.2237 1.9066 2.5024 1.2961 1.5944 1.9643 1.0611 2.8479 1.2588 1.4463 4.3501 1.3649 2.2814 2.3081 8.2606 2.3689 5.6005 2.5211 5.8992 6.1688 6.1406 6.1816 8.7829 12.9158 1.0896 1.0855 1.0889 1.0934 1.0966 1.1002 1.0900 1.0983 1.0997
irintensity: 0.3820 0.0010 0.1337 0.0898 0.0557 0.2781 0.4955 0.5983 0.2380 1.7227 6.0153 4.0234 0.5381 0.0000 5.2918 2.7858 0.8878 20.9993 6.3610 0.0690 1.6774 4.1443 2.5905 22.3438 8.2480 61.2935 107.6326 158.9484 0.6635 40.6390 47.4032 31.3558 16.8555 13.5191 2.6441 10.6747 20.8006 2.1588 5.4393 1.3126 0.0122 0.2888 22.7868 45.9389 13.0402 8.2582 2.7298 20.4801 1.5028 160.2782 5.1817 10.5373 94.3554 10.1389 30.7571 8.6216 2.5228 34.6496 133.8768 101.9571 24.3977 74.4493 3.5107 35.1223 274.7869 431.0650 3.7450 0.2801 9.4006 20.2594 13.1039 21.4399 4.2927 7.6183 0.7723
temp: 298.150 k
press: 1.00000 atm
elementType: 16 8 8 7 6 6 6 6 6 6 6 6 6 6 6 6 6 6 1 1 1 1 1 1 1 1 1
symmnumber: 1
zpe: 502620.3 jmol-1
zpe.correction: 0.191438 hartree
zpe.thermalcorrener: 0.206020 hartree
zpe.thermalcorrenthalpy: 0.206964 hartree
zpe.thermalcorrgfe: 0.147900 hartree
zpe.sumelectzpe: -1140.904365 hartree
zpe.sumelectthermal: -1140.889783 hartree
zpe.sumelectthermalent: -1140.888839 hartree
zpe.sumelectthermalfe: -1140.947903 hartree
dipole: 0.1105 -5.0595 -0.0001
dipole: 5.0607
quadrupole: -80.7963 -113.3037 -115.9068
quadrupole: -1.6605 0.0023 -0.0055
quadrupole: 22.5393 -9.9681 -12.5712 -1.6605 0.0023 -0.0055
hfenergy: -1141.0958029 hartree
pointgroup: C01 [X(C14H9N1O2S1)]
dipole: 0.0449049 -1.9901322 0.0393623 debye
polarizability: 416.2883885|-23.2325644|218.3895055|2.6641269|-3.1641405|66.3532294 unknown
InChI: InChI=1S/C14H9NO2S/c16-14-12(9-11-7-4-8-18-11)15-13(17-14)10-5-2-1-3-6-10/h1-9H
charge 0 multiplicity 1
27 atoms
S  5.004822 0.103174 0.056245
O  -1.184048 1.991119 -0.018349
O  0.543328 3.62093 -0.039286
N  0.092711 0.049658 0.028633
C  -2.404065 -0.146592 0.015903
C  -1.133018 0.566282 0.010358
C  0.985103 1.149568 0.012437
C  2.370278 1.112062 0.021495
C  3.185627 -0.063385 0.049648
C  -2.409846 -1.569733 0.044296
C  -3.634748 0.566651 -0.006808
C  0.222836 2.42387 -0.017337
C  2.824249 -1.422107 0.075302
C  -3.63262 -2.266439 0.049773
C  -4.854194 -0.139785 -0.001104
C  -4.857938 -1.554743 0.027157
C  3.938498 -2.316602 0.099487
C  5.173988 -1.670826 0.093067
H  2.862834 2.093476 0.005023
H  -1.453367 -2.101585 0.061525
H  -3.618249 1.660415 -0.028533
H  1.773811 -1.719034 0.075677
H  -3.636124 -3.361424 0.071537
H  -5.801115 0.410043 -0.018639
H  -5.808077 -2.100203 0.031502
H  3.842393 -3.404486 0.120955
H  6.171032 -2.108004 0.107237
