program: Gaussian 09
title: 000291796
version: EM64L-G09RevD.01
frameworkgroup: C1[X(C6H6N4O4)]
method: RPBEPBE
basis: SDD
operation: Freq
keyword: #pfreq=noraman
keyword: PBEPBE/SDD
title: #p freq=noraman PBEPBE/SDD
converged: NO YES NO YES
title: Mulliken charges:
elementType: O O O O N N N N C C C C C C H H H H H H
charge: -0.200521 -0.200519 -0.266204 -0.266216 0.025552 0.025562 -0.659338 -0.659346 0.279712 0.279698 0.424938 0.424917 -0.564696 -0.578086 0.336276 0.226473 0.316026 0.369872 0.369885 0.316015
chargesum: 0.00000
title: Mulliken charges with hydrogens summed into heavy atoms:
elementType: O O O O N N N N C C C C C C
charge: -0.200521 -0.200519 -0.266204 -0.266216 0.025552 0.025562 0.026559 0.026554 0.279712 0.279698 0.424938 0.424917 -0.228420 -0.351614
polarizability: 2.08820029e+02 6.18284438e-04 1.46992511e+02 -3.29843672e-03 -1.07452315e-03 4.23264766e+01
1716.lowfreq: -7.6342 -5.2662 -0.0006 -0.0005 0.0003 3.2179 54.6886 74.5580 98.6662
frequency: 54.6763 74.5509 98.6652 141.7436 182.8778 224.5667 311.1832 328.9057 343.7302 346.7075 372.2108 400.5499 434.3801 477.6727 512.8861 520.8606 585.1468 591.8712 639.4619 645.4731 676.6009 682.0489 713.7253 744.0912 751.9668 757.3021 759.6229 817.6484 829.6967 972.2261 1025.4188 1028.9402 1106.5583 1115.1701 1179.9183 1210.6076 1253.9618 1281.5796 1323.4170 1345.2824 1364.2928 1450.1145 1503.5084 1516.4160 1542.0416 1582.3054 1600.2579 1653.1575 3132.6372 3182.8327 3389.2572 3392.1755 3639.7463 3640.3507
redmass: 10.6312 13.1302 7.3470 6.4246 12.8756 4.9024 7.6387 5.9006 7.6269 4.0776 6.7975 5.6997 2.8204 8.9886 1.1533 1.2410 3.8793 7.6446 9.9172 3.7390 7.4719 3.8859 7.3778 6.3767 12.7653 1.1366 1.2510 5.6744 1.6770 1.3441 2.5022 1.8025 1.5869 5.2689 4.5233 12.1765 1.7391 1.8637 11.2497 5.2994 4.3768 6.1364 3.5925 5.0732 3.2389 1.2673 1.6733 7.7990 1.0909 1.0911 1.0558 1.0566 1.0945 1.0945
irintensity: 0.0000 0.4960 0.0000 0.0077 4.0269 3.5935 1.6536 0.0000 0.8672 6.8025 8.6673 1.2685 39.9281 0.4718 192.0186 0.0008 0.1698 6.1010 0.0001 67.7657 20.0604 17.1216 0.0000 1.5298 8.8744 0.0053 288.7240 0.0180 34.6354 26.1577 28.5172 1.6298 125.7524 5.2804 724.8509 54.8749 9.5463 87.5216 388.6335 15.6828 20.9618 0.9753 1.6803 0.4755 40.7696 113.8619 337.1134 710.0565 11.1376 20.1496 256.0392 19.7729 1.4995 132.6788
temp: 298.150 k
press: 1.00000 atm
elementType: 8 8 8 8 7 7 7 7 6 6 6 6 6 6 1 1 1 1 1 1
symmnumber: 1
zpe: 355607.9 jmol-1
zpe.correction: 0.135444 hartree
zpe.thermalcorrener: 0.147252 hartree
zpe.thermalcorrenthalpy: 0.148196 hartree
zpe.thermalcorrgfe: 0.097259 hartree
zpe.sumelectzpe: -750.989767 hartree
zpe.sumelectthermal: -750.977959 hartree
zpe.sumelectthermalent: -750.977015 hartree
zpe.sumelectthermalfe: -751.027952 hartree
dipole: -0.0002 8.7749 0.0003
dipole: 8.7749
quadrupole: -95.7445 -71.7946 -81.1761
quadrupole: 0.0006 -0.0023 0.0006
quadrupole: -12.8394 11.1105 1.7289 0.0006 -0.0023 0.0006
hfenergy: -751.1252112 hartree
pointgroup: C01 [X(C6H6N4O4)]
dipole: -0.0001003 3.4523189 0.0008942 debye
dipolederiv: -0.4297195 -0.056059 0.0000808 -0.4432662 -0.981739 -0.0002435 -0.0000103 -0.0001307 -0.2239528 -0.4297555 0.0561199 0.0001123 0.443373 -0.9817164 -0.0001962 0.0002815 -0.000429 -0.2239522 -1.1053629 0.0531616 0.0002916 0.2202663 -0.4881261 -0.0001511 0.0005687 -0.0001289 -0.2753837 -1.1053638 -0.0532153 0.0002061 -0.2204225 -0.488192 -0.000037 0.0004562 0.0000353 -0.2753918 1.901693 0.3852329 -0.0005042 0.7236271 1.3263484 0.0002792 -0.0005013 0.0002159 0.192932 1.9018264 -0.3851989 -0.0006373 -0.7235306 1.3262689 0.0004384 -0.0008637 0.0005659 0.192936 -1.1609884 0.464075 0.0003229 0.5752916 -0.6117104 -0.0001915 0.0002815 -0.000104 -0.618638 -1.1609706 -0.464046 0.0000418 -0.5752322 -0.6117318 0.0003226 -0.0000321 0.0001915 -0.6186299 -1.2469862 -0.3301979 0.000334 0.0654875 -0.5958062 -0.0001889 0.0003018 -0.0001169 -0.0300675 -1.2470369 0.3301426 0.0005234 -0.0655561 -0.5957774 -0.0001314 0.0002389 -0.0002099 -0.0300617 1.3091999 -0.3877623 -0.0005393 -0.2800941 0.8734248 0.0002998 -0.0005159 0.0004208 0.1845146 1.3091597 0.387739 -0.0004231 0.2800435 0.8734031 0.0000339 -0.0005454 -0.0000893 0.1845092 1.185231 0.00006 -0.0003795 0.0000495 -0.1649265 -0.0000472 -0.0004725 -0.0000761 -0.0096665 -0.9974365 -0.0000108 0.0002847 -0.0000283 0.0300008 0.0000879 0.000346 0.000144 -0.2838676 0.1431152 0.0000028 0.0000071 0.0000037 0.1373488 -0.0000079 0.0000714 -0.0000048 0.1718919 0.0386176 0.0000034 0.0000566 0.0000071 -0.1106039 -0.0000893 0.0001169 -0.0000766 0.1794428 0.214876 -0.0826046 0.0000314 -0.1097958 0.1797595 -0.000029 0.0000332 -0.0000524 0.3694304 0.3325018 0.0420907 0.0000436 -0.0416052 0.3519814 0.0000192 0.0000478 -0.0000549 0.3722655 0.3325175 -0.0421429 0.0000218 0.0415985 0.352069 -0.0000564 0.000061 -0.0000127 0.3722675 0.2148825 0.0826099 0.0001255 0.1097833 0.1797248 -0.0001116 0.0001362 -0.0000873 0.3694217 unknown
polarizability: 208.8200079|0.0025215|146.992501|-0.0599334|0.0317106|42.3265077 unknown
InChI: InChI=1S/C6H6N4O4/c7-3-1-4(8)6(10(13)14)2-5(3)9(11)12/h1-2H,7-8H2
charge 0 multiplicity 1
20 atoms
O  -2.339539 -2.276514 -0.00009
O  2.339737 -2.276294 -0.001435
O  -3.600686 -0.381536 0.001218
O  3.600618 -0.381112 -0.001413
N  -2.437683 -0.990143 0.000253
N  2.437724 -0.98991 -0.000836
N  -2.423346 1.974012 0.001461
N  2.42322 1.974082 -0.000528
C  -1.222951 -0.184499 0.000238
C  1.222902 -0.184416 -0.000466
C  -1.247552 1.271096 0.000813
C  1.247431 1.271156 -0.000139
C  0.000002 -0.872553 -0.000318
C  -0.000074 1.942647 0.000603
H  0.000042 -1.965939 -0.000616
H  -0.000096 3.038908 0.000956
H  -2.41752 2.991381 0.001836
H  -3.298116 1.434048 0.001687
H  3.297994 1.434137 -0.001345
H  2.417397 2.991451 -0.00018
