program: Gaussian 09
title: 000027994
version: EM64L-G09RevD.01
frameworkgroup: C1[X(C4H4BrN3O2)]
method: RPBEPBE
basis: SDD
operation: Freq
keyword: #p
keyword: freq=noraman
keyword: PBEPBE/SDD
title: #p freq=noraman PBEPBE/SDD
converged: NO YES NO YES
title: Mulliken charges:
elementType: Br O O N N N C C C C H H H H
charge: 0.101364 -0.226163 -0.175199 -0.068022 0.052642 0.075376 -0.248707 0.120444 -0.123218 -0.605869 0.311150 0.270341 0.270331 0.245532
chargesum: 0.00000
title: Mulliken charges with hydrogens summed into heavy atoms:
elementType: Br O O N N N C C C C
charge: 0.101364 -0.226163 -0.175199 -0.068022 0.052642 0.075376 0.062443 0.120444 -0.123218 0.180335
polarizability: 1.37521594e+02 5.28876914e-01 9.18778700e+01 -5.66076468e-03 4.06965308e-03 3.57684431e+01
1716.lowfreq: -7.1815 -4.6274 -4.4203 0.0011 0.0011 0.0011 56.9244 79.7149 119.1625
frequency: 56.9216 79.6951 119.1624 136.7900 189.2657 204.2636 280.5366 297.6700 379.8343 452.7821 556.6174 595.8911 641.0614 675.0476 709.3834 756.0620 808.6697 942.6257 1042.2076 1078.5329 1107.4201 1122.4903 1209.7483 1291.4553 1299.9525 1361.3398 1376.7141 1401.3289 1448.6156 1465.4867 1486.7237 1504.0309 3013.0656 3106.6533 3133.3518 3269.4045
redmass: 11.4912 1.0735 6.5050 13.7510 3.9940 3.9284 20.9298 7.0691 6.7122 5.8374 7.1227 4.7228 8.8002 5.9926 5.3587 11.0692 1.5815 7.5593 1.8570 4.1938 1.7979 1.3244 6.7430 7.5537 4.1552 8.2436 11.9095 4.6260 1.4222 1.0386 1.1092 4.6810 1.0338 1.1029 1.1019 1.1018
irintensity: 1.3207 0.0360 0.5777 1.3774 1.0141 2.2933 0.7581 5.9542 0.0343 7.2206 0.4126 0.2880 5.4521 8.0905 13.9129 33.1486 30.5060 5.3255 22.2600 92.9671 5.9049 1.4926 204.2204 47.3227 17.9235 106.8653 105.2977 74.4331 5.9758 18.4013 36.9827 100.9672 18.2944 9.3446 5.9477 10.5099
temp: 298.150 k
press: 1.00000 atm
elementType: 35 8 8 7 7 7 6 6 6 6 1 1 1 1
symmnumber: 1
zpe: 230884.1 jmol-1
zpe.correction: 0.087939 hartree
zpe.thermalcorrener: 0.097445 hartree
zpe.thermalcorrenthalpy: 0.098389 hartree
zpe.thermalcorrgfe: 0.051101 hartree
zpe.sumelectzpe: -482.137217 hartree
zpe.sumelectthermal: -482.127711 hartree
zpe.sumelectthermalent: -482.126767 hartree
zpe.sumelectthermalfe: -482.174055 hartree
dipole: 5.7152 6.2501 0.0004
dipole: 8.4692
quadrupole: -81.7687 -61.8117 -65.7029
quadrupole: -2.1321 -0.0015 0.0002
quadrupole: -12.0076 7.9494 4.0582 -2.1321 -0.0015 0.0002
hfenergy: -482.225156 hartree
pointgroup: C01 [X(C4H4Br1N3O2)]
dipole: 2.8033787 1.8010021 0.0001741 debye
dipolederiv: -0.4666207 0.2498365 0.0000597 0.2525382 -0.1393917 -0.0000591 0.0000496 0.0000036 0.0499344 -0.7846546 0.1865711 0.0000758 0.2534716 -0.6787852 -0.000167 -0.0000922 0.0001374 -0.2492459 -0.6589301 -0.2225228 0.0000319 -0.2194361 -0.65877 0.0000932 -0.0000983 -0.0001887 -0.2048932 -0.8660886 -0.1748748 -0.0000199 0.2154706 -0.3017129 -0.0000306 0.000234 0.0000666 -0.0698378 -0.6158384 0.1200468 0.0000422 -0.1212142 -0.3757075 -0.0000033 0.0001125 -0.0000242 -0.1444979 1.8818662 0.1068144 -0.0000555 0.0897884 1.1236056 0.0000777 -0.0000557 0.0000211 0.2043159 0.5876303 0.2870509 0.0000047 0.2373689 -0.1453585 -0.0000134 -0.0000135 -0.0000566 -0.0961143 -0.6273568 -0.2095624 -0.0000477 -0.335044 0.0505442 -0.0000077 0.0001099 0.000029 0.0412342 1.0550708 -0.502329 -0.0001226 -0.516571 0.6795207 0.0000861 -0.0001466 0.000096 -0.0569502 0.3168681 0.171526 0.0000919 0.1572458 0.251651 0.0000728 -0.0000333 -0.0000334 0.1978048 0.1187447 -0.0085912 0.0000133 -0.0019294 0.0817545 -0.0000056 0.0000064 0.0000081 0.2267887 0.0035867 -0.0521126 -0.0588358 -0.0090402 0.0842896 0.05896 -0.0877756 0.0162911 -0.0166996 0.0035706 -0.0519679 0.0588749 -0.0087932 0.0843034 -0.0591366 0.0877389 -0.0164731 -0.0164216 0.052152 0.100115 -0.0001129 0.0061445 -0.0559433 0.0001335 -0.0000362 0.0001233 0.1345826 unknown
polarizability: 134.7888412|-10.8418073|94.6106227|-0.0044295|0.0053839|35.7684431 unknown
InChI: InChI=1S/C4H4BrN3O2/c1-7-2-3(8(9)10)6-4(7)5/h2H,1H3
charge 0 multiplicity 1
14 atoms
Br 2.955865 -1.664926 -0.0004
O  -2.78281 1.075105 0.000065
O  -2.738699 -1.216688 -0.00009
N  1.362007 0.773048 -0.000074
N  0.102495 -1.131157 -0.000026
N  -2.163859 -0.068426 0.000376
C  0.031298 1.183132 0.000142
C  -0.713286 -0.001669 0.000171
C  1.339639 -0.633297 -0.000178
C  2.550963 1.641324 -0.000095
H  -0.280114 2.222296 0.000269
H  3.162212 1.45367 0.898019
H  3.162973 1.45249 -0.897437
H  2.225718 2.692195 -0.00094
