program: Gaussian 09
title: 000291863
version: EM64L-G09RevD.01
frameworkgroup: C1[X(C21H18N2)]
method: RPBEPBE
basis: SDD
operation: Freq
keyword: #pfreq=noraman
keyword: PBEPBE/SDD
title: #p freq=noraman PBEPBE/SDD
converged: YES YES NO NO
title: Mulliken charges:
elementType: N N C C C C C C C C C C C C C C C C C C C C C H H H H H H H H H H H H H H H H H H
charge: -0.453066 -0.467997 -0.277402 0.158029 0.176898 0.449125 0.301829 0.293518 -0.416955 -0.365233 -0.425824 -0.428471 -0.393996 -0.395774 -0.226885 -0.225460 -0.237181 -0.233873 -0.234037 -0.234895 -0.233751 -0.255640 -0.257092 0.226374 0.303263 0.285357 0.234742 0.264291 0.258120 0.250905 0.261884 0.262812 0.227348 0.227198 0.229789 0.223018 0.223071 0.225721 0.226221 0.226812 0.227207
chargesum: 0.00000
title: Mulliken charges with hydrogens summed into heavy atoms:
elementType: N N C C C C C C C C C C C C C C C C C C C C C
charge: -0.149803 -0.182640 -0.051028 0.158029 0.176898 0.449125 0.301829 0.293518 -0.182213 -0.100941 -0.167704 -0.177566 -0.132112 -0.132962 0.000463 0.001738 -0.007392 -0.010856 -0.010966 -0.009174 -0.007530 -0.028828 -0.029885
polarizability: 3.19294233e+02 -1.04986225e+01 3.10133092e+02 1.87521057e+01 -1.96994806e+01 1.66086306e+02
1716.lowfreq: -5.6217 -1.7851 -0.0004 0.0001 0.0004 6.0618 16.0107 27.7822 42.0855
frequency: 15.8423 27.7471 42.0819 47.3060 50.9369 81.1150 108.4771 139.5187 150.7251 205.7282 235.9242 244.2737 247.8181 295.1537 335.4521 348.0414 402.0812 405.9287 409.8068 423.6696 450.7485 461.6071 500.6217 524.6119 538.7908 578.0569 613.6402 614.2284 615.7905 626.8715 653.4717 662.8789 696.1730 699.2392 705.1210 707.5952 763.9504 767.9867 771.4414 807.7357 843.4969 849.6934 857.8582 860.5535 916.4309 921.4505 926.9329 932.5178 977.0234 980.1504 981.6029 982.4217 986.2232 989.5563 990.5187 992.4260 994.8803 999.7450 1020.4269 1025.0662 1027.7604 1064.0585 1068.6144 1079.8412 1081.1546 1085.1086 1134.2848 1170.8333 1171.2423 1171.4217 1180.1069 1187.6130 1190.7537 1203.4133 1281.1709 1284.9485 1301.5121 1312.0878 1319.9699 1323.2487 1348.8129 1374.2058 1374.7814 1380.3996 1388.5283 1417.5785 1436.1432 1439.5416 1447.1931 1477.6912 1479.1101 1493.5407 1570.7913 1573.2935 1596.6375 1608.8705 1609.5229 1611.0903 1625.3025 2871.6264 3111.8004 3120.9206 3122.1121 3125.9999 3128.7277 3130.2266 3138.2040 3142.2584 3145.1173 3150.0318 3153.4868 3154.7993 3163.6069 3165.6204 3166.4270 3509.6128 3543.5817
redmass: 4.8312 3.8348 5.0768 3.9702 4.6904 4.0915 4.9628 4.3434 4.6309 4.1924 4.4440 5.5263 4.3777 4.4090 3.9625 4.6134 2.7685 2.8907 2.9162 4.6370 2.1934 1.8592 3.4701 3.5023 2.0032 3.7748 6.4500 6.4268 6.3659 5.3549 6.2043 5.8581 4.5035 1.8836 2.0470 1.7397 1.7749 1.8851 1.9619 3.9597 2.8787 1.2477 1.2708 1.2991 1.4548 1.4750 1.9881 2.6464 1.4265 1.5444 1.9871 2.3267 4.9584 3.5767 1.5267 1.7079 2.3910 1.3428 2.6344 2.1485 2.0754 2.3753 2.4507 1.9282 1.7417 1.8313 2.9621 1.0549 1.0555 1.0641 1.1285 1.1157 1.1214 2.7223 1.2709 1.3374 2.2837 1.7991 1.3559 1.5588 1.6610 5.7667 4.9056 1.9163 4.5424 1.8844 2.4410 2.3361 2.0246 2.3327 2.2849 2.7766 5.7151 5.8274 6.0726 6.0153 5.9823 6.1312 8.0210 1.0859 1.0877 1.0846 1.0844 1.0861 1.0876 1.0879 1.0911 1.0932 1.0928 1.0954 1.0957 1.0956 1.1013 1.1009 1.1005 1.0776 1.0779
irintensity: 0.3021 0.1328 0.0250 1.9206 0.0546 0.1782 4.0627 0.1575 1.8326 1.5174 1.6434 0.5933 0.1625 0.4371 10.6202 2.0117 1.5611 3.9903 0.7543 18.9203 132.2944 41.0264 17.2333 22.4164 215.4237 3.4051 0.5268 0.3155 0.0532 39.9052 4.5683 1.7231 26.8145 52.9960 10.3463 48.3020 147.0142 9.5936 11.0853 51.3707 14.1485 0.2818 1.0183 2.6046 10.3136 1.2240 7.3718 17.2063 0.0048 0.8158 0.6069 0.9254 2.9912 0.5052 0.5731 0.7308 5.2348 0.3383 33.2782 4.3206 3.4857 19.5972 17.9089 3.8451 9.9093 15.3404 21.6660 0.1184 0.2618 1.1570 11.3835 1.6580 1.5541 10.0998 0.6058 30.5407 65.9690 20.5556 9.8626 10.3178 10.5189 10.6416 94.0974 309.1868 44.6593 7.1198 19.2558 5.2574 22.9922 0.6704 11.5595 106.7558 1.9008 7.9315 0.8225 112.9446 25.0539 7.3507 109.2595 129.6069 7.6918 7.3934 4.8476 0.1742 3.0972 5.4510 16.7040 22.8752 22.8927 30.0656 63.4259 2.4283 30.5606 19.8135 19.0232 17.0173 18.6429
temp: 298.150 k
press: 1.00000 atm
elementType: 7 7 6 6 6 6 6 6 6 6 6 6 6 6 6 6 6 6 6 6 6 6 6 1 1 1 1 1 1 1 1 1 1 1 1 1 1 1 1 1 1
symmnumber: 1
zpe: 866954.7 jmol-1
zpe.correction: 0.330206 hartree
zpe.thermalcorrener: 0.348924 hartree
zpe.thermalcorrenthalpy: 0.349868 hartree
zpe.thermalcorrgfe: 0.280715 hartree
zpe.sumelectzpe: -918.943915 hartree
zpe.sumelectthermal: -918.925197 hartree
zpe.sumelectthermalent: -918.924253 hartree
zpe.sumelectthermalfe: -918.993405 hartree
dipole: -1.6172 -0.2802 -0.1210
dipole: 1.6457
quadrupole: -119.3956 -126.7213 -131.3183
quadrupole: -0.7659 3.4360 -2.5776
quadrupole: 6.4161 -0.9096 -5.5065 -0.7659 3.4360 -2.5776
hfenergy: -919.2741204 hartree
pointgroup: C01 [X(C21H18N2)]
dipole: -0.6424612 -0.0690731 -0.0412115 debye
polarizability: 316.8406389|-5.1669364|290.5411977|21.6567631|-55.8063251|188.1317946 unknown
InChI: InChI=1S/C21H18N2/c1-4-10-16(11-5-1)19-20(17-12-6-2-7-13-17)23-21(22-19)18-14-8-3-9-15-18/h1-15,21-23H
charge 0 multiplicity 1
41 atoms
N  -0.870679 0.767385 -1.191021
N  -0.904287 -1.401577 -0.38464
C  -1.767468 -0.429081 -1.106821
C  0.407419 0.46513 -0.611793
C  0.417072 -0.866756 -0.219662
C  -3.093143 -0.118653 -0.402513
C  1.397386 1.543276 -0.490552
C  1.47969 -1.747829 0.278821
C  -4.244466 0.179871 -1.170418
C  -3.171825 -0.086606 1.011382
C  1.386121 2.619005 -1.428364
C  1.149316 -2.844495 1.131333
C  2.341263 1.590984 0.57786
C  2.842828 -1.585077 -0.109175
C  -5.460967 0.5204 -0.535282
C  -4.386515 0.249261 1.647971
C  -5.53321 0.557131 0.876326
C  2.301532 3.686751 -1.315824
C  2.147431 -3.726773 1.596364
C  3.256992 2.65599 0.682038
C  3.835682 -2.465558 0.362173
C  3.24617 3.711611 -0.263349
C  3.497905 -3.542836 1.21896
H  -2.002783 -0.794123 -2.134437
H  -1.298151 1.668832 -0.958809
H  -0.99909 -2.386431 -0.639728
H  -4.188987 0.143079 -2.266401
H  -2.28099 -0.345915 1.594036
H  0.672052 2.590752 -2.258847
H  0.109297 -2.979365 1.449993
H  2.341037 0.797109 1.331554
H  3.113767 -0.775033 -0.793798
H  -6.348266 0.74925 -1.136241
H  -4.443783 0.268668 2.742273
H  -6.475658 0.816682 1.371745
H  2.281002 4.497901 -2.052829
H  1.871497 -4.556145 2.257889
H  3.972425 2.672832 1.512251
H  4.876001 -2.32198 0.048341
H  3.955921 4.541529 -0.174843
H  4.272662 -4.229399 1.577538
