program: Gaussian 09
title: 000291810
version: EM64L-G09RevD.01
frameworkgroup: C1[X(C15H13N3O)]
method: RPBEPBE
basis: SDD
operation: Freq
keyword: #p
keyword: freq=noraman
keyword: PBEPBE/SDD
title: #p freq=noraman PBEPBE/SDD
converged: YES YES NO NO
title: Mulliken charges:
elementType: O N N N C C C C C C C C C C C C C C C H H H H H H H H H H H H H
charge: -0.223510 -0.391532 -0.023609 -0.095963 0.412971 0.316558 -0.467160 0.470002 0.161379 0.152492 -0.385212 -0.438442 0.036254 -0.812725 -0.314796 -0.813782 -0.301829 -0.228072 -0.202458 0.252985 0.231783 0.232116 0.228459 0.266281 0.221974 0.278784 0.231055 0.237843 0.222403 0.264926 0.240271 0.240553
chargesum: 0.00000
title: Mulliken charges with hydrogens summed into heavy atoms:
elementType: O N N N C C C C C C C C C C C C C C C
charge: -0.223510 -0.391532 -0.023609 -0.095963 0.412971 0.316558 -0.214176 0.470002 0.161379 0.152492 -0.153429 -0.206326 0.036254 -0.096010 -0.036012 -0.122481 -0.036903 0.012199 0.038095
polarizability: 3.00275055e+02 1.96733999e+00 1.72460594e+02 -4.31140830e+00 -8.71884780e+00 1.13272149e+02
1716.lowfreq: -6.3718 -3.2659 -0.0009 -0.0008 -0.0007 4.7698 30.8233 37.7197 42.5043
frequency: 30.7063 37.7013 42.4270 74.0830 110.5829 120.7574 138.6583 154.1873 210.8959 223.7298 236.3340 291.5206 308.3649 327.0395 333.1944 421.6542 440.8806 445.2730 455.6897 476.8589 487.7158 509.5192 548.9723 580.1019 603.2597 606.5541 677.4410 679.9736 712.0799 723.7355 742.4650 778.8696 790.4408 811.1415 822.1650 856.8743 883.2821 901.4658 917.6658 948.0146 961.8819 983.9128 991.2247 1009.1313 1010.9190 1019.7603 1046.1982 1048.9139 1050.9819 1099.0056 1152.4262 1165.1793 1182.0488 1191.3883 1219.5393 1226.4497 1273.0025 1282.7107 1291.8550 1366.7509 1373.3577 1397.9472 1399.8508 1406.4676 1412.6469 1443.5234 1461.2154 1463.9747 1470.1109 1471.4698 1482.7582 1504.7425 1566.8262 1583.5798 1612.5777 1613.5106 1630.1074 2978.8973 2984.8652 3058.2246 3067.2572 3085.8769 3090.8859 3121.1860 3141.6855 3143.4565 3147.9702 3155.8810 3169.7416 3179.1303
redmass: 4.8024 5.2176 1.0475 5.1624 5.5292 1.5285 1.8070 3.3559 4.8570 6.1384 4.2458 5.8857 3.3174 3.9738 3.9601 3.4140 4.0115 3.4009 4.8457 8.2191 4.5443 4.9120 9.5649 5.1094 6.2919 5.1484 6.4899 4.5457 5.5463 3.5249 4.3984 3.8381 1.4966 6.5682 1.2842 6.8553 1.5663 1.4406 3.9106 3.2195 1.5605 1.3751 1.8175 1.3418 1.4027 2.2923 1.5702 2.8473 1.5934 2.1187 1.4879 1.2369 2.3884 2.4327 1.8388 3.5255 2.1166 1.7196 2.1877 6.7796 7.0407 1.2981 1.2319 5.0460 4.4170 2.5243 2.5807 1.0886 1.0576 1.0771 1.1088 3.1951 7.1328 5.7240 7.3760 9.4647 7.2619 1.0371 1.0369 1.0978 1.0971 1.0989 1.0996 1.0873 1.0866 1.0949 1.0944 1.0904 1.0957 1.1000
irintensity: 0.0363 3.2051 0.1742 2.4977 1.7924 1.9886 0.3490 0.7232 1.0416 1.9454 0.5606 2.4267 0.3245 2.5467 0.5019 1.1110 1.6064 2.3427 1.2134 6.2769 15.6097 1.2637 7.3585 6.8039 3.5490 7.3108 2.3756 20.3760 23.0613 1.5880 3.7397 19.2704 57.2274 5.5649 29.8506 72.0294 8.7077 0.2613 31.0309 69.0890 16.0149 2.7621 27.3370 0.0688 2.7817 6.4625 2.9999 16.2240 11.3924 3.8306 12.7709 7.2839 6.8376 1.1807 1.5011 13.0670 18.5740 1.8792 9.4434 28.6577 51.7993 22.9726 0.6630 0.7773 8.6099 25.5106 0.5067 17.4765 8.0971 6.8096 42.2117 42.8149 15.2735 2.7533 69.4203 103.2919 34.1653 37.0681 21.6434 18.3492 13.0368 20.1882 26.8484 11.0249 3.6781 33.6075 4.8521 6.9620 5.7842 20.0121
temp: 298.150 k
press: 1.00000 atm
elementType: 8 7 7 7 6 6 6 6 6 6 6 6 6 6 6 6 6 6 6 1 1 1 1 1 1 1 1 1 1 1 1 1
symmnumber: 1
zpe: 643921.6 jmol-1
zpe.correction: 0.245257 hartree
zpe.thermalcorrener: 0.261529 hartree
zpe.thermalcorrenthalpy: 0.262474 hartree
zpe.thermalcorrgfe: 0.200283 hartree
zpe.sumelectzpe: -817.530671 hartree
zpe.sumelectthermal: -817.514398 hartree
zpe.sumelectthermalent: -817.513454 hartree
zpe.sumelectthermalfe: -817.575645 hartree
dipole: 1.7789 -0.4865 0.1819
dipole: 1.8532
quadrupole: -78.7109 -109.7943 -115.4500
quadrupole: -2.8560 1.4023 7.7816
quadrupole: 22.6075 -8.4759 -14.1316 -2.8560 1.4023 7.7816
hfenergy: -817.7759275 hartree
pointgroup: C01 [X(C15H13N3O1)]
dipole: -0.7046018 0.1719148 0.0747802 debye
polarizability: 300.0878816|5.1866173|172.2962012|4.1904641|9.9325411|113.6237161 unknown
InChI: InChI=1S/C15H13N3O/c1-10-7-8-11(2)14(9-10)18-15(19)12-5-3-4-6-13(12)16-17-18/h3-9H,1-2H3
charge 0 multiplicity 1
32 atoms
O  -0.225117 1.648356 1.175073
N  0.147131 -0.239733 -0.195208
N  -0.307764 -1.317969 -1.036902
N  -1.589567 -1.485696 -1.221383
C  1.59322 -0.181674 -0.07335
C  2.302242 -1.286121 0.475464
C  2.253918 0.982372 -0.516385
C  3.662195 1.094093 -0.436845
C  -2.130498 0.476252 0.219184
C  -0.693885 0.716042 0.463744
C  3.711605 -1.165459 0.53916
C  4.381695 -0.005276 0.092312
C  -2.530661 -0.612965 -0.611335
C  1.605191 -2.531683 0.987981
C  -3.113686 1.313633 0.802854
C  4.366729 2.356539 -0.900933
C  -3.908014 -0.858828 -0.856646
C  -4.476143 1.064779 0.558513
C  -4.872986 -0.021728 -0.272331
H  1.661352 1.812662 -0.914893
H  4.291644 -1.997052 0.956118
H  5.474522 0.049474 0.163433
H  0.763107 -2.279288 1.65884
H  1.187825 -3.126713 0.156494
H  2.310388 -3.166446 1.550446
H  -2.782012 2.142073 1.436477
H  4.121715 2.592892 -1.953174
H  4.063958 3.229277 -0.292328
H  5.462963 2.25694 -0.824007
H  -4.179592 -1.701276 -1.49971
H  -5.23809 1.709832 1.008452
H  -5.936885 -0.204613 -0.456014
