program: Gaussian 09
title: 000291805
version: EM64L-G09RevD.01
frameworkgroup: C1[X(C10H5BrClNO2)]
method: RPBEPBE
basis: SDD
operation: Freq
keyword: #p
keyword: freq=noraman
keyword: PBEPBE/SDD
title: #p freq=noraman PBEPBE/SDD
converged: YES YES NO NO
title: Mulliken charges:
elementType: Br Cl O O N C C C C C C C C C C H H H H H
charge: 0.042971 -0.009904 -0.157710 -0.167321 -0.370669 0.653928 0.162295 0.151182 -0.294222 -0.315044 -0.236035 -0.239934 -0.169660 -0.180666 -0.223842 0.258864 0.278189 0.278136 0.279907 0.259536
chargesum: 0.00000
title: Mulliken charges with hydrogens summed into heavy atoms:
elementType: Br Cl O O N C C C C C C C C C C
charge: 0.042971 -0.009904 -0.157710 -0.167321 -0.370669 0.653928 0.162295 0.151182 -0.294222 -0.056180 0.042154 0.038202 0.110247 0.078870 -0.223842
polarizability: 2.08287557e+02 -5.77780381e+00 1.28450156e+02 2.09877939e+00 7.11760954e+00 8.96743099e+01
1716.lowfreq: -4.3142 -0.4119 -0.0029 -0.0023 -0.0017 5.5929 30.5789 44.7990 71.2635
frequency: 30.5351 44.7924 71.2612 130.2620 137.9536 154.0882 158.7289 189.5824 266.9845 288.8935 328.5559 340.0604 387.1004 445.3968 480.6278 500.9012 538.7175 576.1316 619.6991 632.1940 663.1809 680.7154 716.5348 734.2393 751.0614 816.5089 828.5468 874.1022 937.8286 944.4401 953.9457 1009.2841 1033.1512 1066.4373 1072.0587 1096.8442 1143.5519 1203.5174 1250.0391 1287.3040 1352.0892 1357.0392 1378.6622 1467.9488 1565.1364 1584.7482 1590.5122 1635.4843 1684.6108 3162.1483 3183.0321 3185.3098 3205.8523 3233.8085
redmass: 10.8421 8.6627 6.8411 11.1221 10.5388 15.3508 6.0356 19.7079 9.3716 4.2644 10.8264 7.3152 10.0880 3.3398 5.8154 8.9925 5.1006 3.8593 9.3489 2.4327 7.0945 7.2969 4.1967 7.0431 8.4063 1.4249 1.9548 1.4195 7.2767 1.3132 1.4050 4.3808 2.6321 1.7615 1.9792 5.5119 1.3658 3.1556 1.3304 1.7124 3.7665 6.3244 4.9543 3.2707 8.5731 6.9495 7.5491 11.8539 11.7212 1.0896 1.0944 1.0963 1.0897 1.1105
irintensity: 0.5066 0.4145 2.6682 7.0319 1.5943 0.7946 0.3969 0.0813 0.3408 0.1019 10.4126 1.0039 12.5850 8.0656 5.9417 4.6911 1.1520 14.3934 4.5973 1.8998 5.3211 39.3526 8.6058 1.4762 66.1339 11.6551 80.4943 16.9780 35.4278 0.0980 2.3209 10.6187 21.4983 46.4684 18.7407 72.1589 2.6561 45.3977 5.1654 1.7192 98.8602 66.0716 46.2478 306.0414 21.1020 5.5844 16.2725 423.5057 4.7489 1.9547 0.0828 1.6579 0.0598 0.6510
temp: 298.150 k
press: 1.00000 atm
elementType: 35 17 8 8 7 6 6 6 6 6 6 6 6 6 6 1 1 1 1 1
symmnumber: 1
zpe: 328806.4 jmol-1
zpe.correction: 0.125236 hartree
zpe.thermalcorrener: 0.138285 hartree
zpe.thermalcorrenthalpy: 0.139230 hartree
zpe.thermalcorrgfe: 0.083062 hartree
zpe.sumelectzpe: -1061.736035 hartree
zpe.sumelectthermal: -1061.722986 hartree
zpe.sumelectthermalent: -1061.722041 hartree
zpe.sumelectthermalfe: -1061.778209 hartree
dipole: -2.0621 -1.2943 0.5153
dipole: 2.4885
quadrupole: -81.7364 -102.7175 -110.0654
quadrupole: 2.4936 -0.7432 -9.6990
quadrupole: 16.4367 -4.5444 -11.8923 2.4936 -0.7432 -9.6990
hfenergy: -1061.861271 hartree
pointgroup: C01 [X(C10H5Br1Cl1N1O2)]
dipole: -0.8366386 -0.008754 0.5084556 debye
dipolederiv: -0.7682437 -0.0049102 -0.0399582 -0.0049702 -0.0128208 0.0034991 -0.0073675 0.0006761 -0.0523466 -0.273429 -0.0196052 -0.2512484 -0.0006188 -0.0269251 -0.0151286 -0.2927922 -0.0165487 -0.5656017 -0.4192466 -0.2134075 0.0656544 0.2166133 -0.9001609 0.1727798 -0.0648521 0.1955707 -0.3317262 -0.42498 0.2221825 -0.0641879 -0.2259243 -0.8953878 0.2341361 0.0745581 0.2425854 -0.3788161 -1.4059819 -0.0021279 0.036774 -0.0229512 -0.9529317 0.2878432 0.0184923 0.2997964 -0.3000029 0.8330925 -0.0034259 -0.1560249 -0.0160692 -0.0093192 0.0310746 -0.0862488 0.0559604 -0.088793 1.0064002 0.008895 -0.0228581 -0.6028933 1.2938882 -0.2727709 0.3045441 -0.378166 0.3414696 1.011759 -0.0151729 -0.0184193 0.6264463 1.2874603 -0.4096747 -0.3334394 -0.4107697 0.4021283 0.3541242 0.0178903 0.4552291 -0.0457062 -0.0359323 0.0055572 0.341536 0.0343031 0.8419453 0.0367184 0.0162786 0.011245 0.0743488 -0.0752268 -0.0309909 0.0617305 0.0014469 0.0381177 -0.2403187 -0.2284885 0.097618 -0.1502385 -0.0322943 -0.0423424 0.0356857 -0.0430286 -0.1083059 -0.2464155 0.2354985 -0.0720498 0.1567598 -0.0316287 -0.0375845 -0.0291854 -0.0227968 -0.1247787 -0.5586303 0.0001408 -0.2558943 -0.0171328 -0.0358669 -0.0055346 -0.1418376 -0.0069802 -0.2019638 -0.4834995 -0.0199242 0.1278376 0.0068365 -0.0860717 -0.0081556 0.056125 -0.0091697 -0.0160685 1.4099884 0.0124602 0.0491776 0.0169266 -0.1260713 -0.0127792 0.0289555 -0.0156594 0.1545106 0.0244563 -0.0049072 0.061557 -0.0025535 0.1349407 0.0164888 0.0636857 -0.0057709 0.0121644 0.0107705 0.0290124 -0.010034 0.0423794 0.0912428 0.0338096 -0.0362872 0.0335016 0.1650928 0.0093424 -0.0311694 0.0118225 -0.0473427 0.0895238 0.0327512 0.0272877 0.0344463 0.1649631 0.0722003 0.0002322 0.0317153 -0.0013546 0.1619736 0.0071041 0.039747 0.0042671 0.0405725 0.0518931 0.0005485 -0.0579555 -0.0025554 0.1616081 0.0099176 -0.0603377 0.006336 0.0074393 unknown
polarizability: 207.4901237|0.6407467|100.455078|10.459147|-18.7637542|118.4668216 unknown
InChI: InChI=1S/C10H5BrClNO2/c11-6-1-2-8(7(12)5-6)13-9(14)3-4-10(13)15/h1-5H
charge 0 multiplicity 1
20 atoms
Br 5.029869 0.04347 0.232324
Cl 0.138034 0.055965 -2.621139
O  -1.595336 2.242527 -0.625732
O  -1.58018 -2.164976 1.043641
N  -1.174781 0.0289 0.17998
C  0.254526 0.027773 0.180987
C  -2.001035 1.124175 -0.242442
C  -1.993705 -1.071133 0.597801
C  0.995962 0.064119 -1.025265
C  0.959442 -0.027658 1.40562
C  -3.420543 0.645296 -0.095009
C  -3.416676 -0.624006 0.393896
C  2.404091 0.080197 -1.024799
C  2.368721 -0.034073 1.435387
C  3.07318 0.030445 0.215205
H  0.391896 -0.067658 2.34002
H  -4.265834 1.283234 -0.353358
H  -4.257615 -1.276946 0.627822
H  2.955711 0.117282 -1.966996
H  2.902872 -0.080231 2.387559
