program: Gaussian 09
title: 000291787
version: EM64L-G09RevD.01
frameworkgroup: C1[X(C10H12N2OS)]
method: RPBEPBE
basis: SDD
operation: Freq
keyword: #p
keyword: freq=noraman
keyword: PBEPBE/SDD
title: #p freq=noraman PBEPBE/SDD
converged: NO YES NO NO
title: Mulliken charges:
elementType: S O N N C C C C C C C C C C H H H H H H H H H H H H
charge: 0.126515 -0.266809 -0.379985 -0.056115 -0.678251 -0.389365 -0.165526 0.457504 -0.460075 -0.308791 0.323154 -0.327931 -0.363018 -0.537870 0.273509 0.273648 0.232242 0.232282 0.316119 0.216591 0.314531 0.239777 0.247725 0.243982 0.218115 0.218041
chargesum: 0.00000
title: Mulliken charges with hydrogens summed into heavy atoms:
elementType: S O N N C C C C C C C C C C
charge: 0.126515 -0.266809 -0.063866 -0.056115 -0.131093 0.075159 -0.165526 0.457504 -0.243484 0.005739 0.323154 -0.088154 -0.115293 0.142268
polarizability: 2.47306951e+02 5.53656169e+00 1.41003825e+02 1.43478720e-05 -7.72697541e-03 6.82107087e+01
1716.lowfreq: -112.3348 -0.0012 0.0007 0.0014 7.5345 9.5386 19.1465 42.2986 55.3878
frequency: -112.3336 42.2753 55.2522 92.9556 97.4506 153.0465 202.9090 221.0142 225.9570 252.3981 321.4091 365.0706 416.8562 427.0422 497.6190 510.7057 523.6636 531.3203 560.5419 599.1361 630.4451 712.5343 719.6218 724.9469 796.7330 798.0239 798.6824 817.4605 850.0109 909.0478 915.3471 972.3140 987.1152 988.8291 998.6540 1002.0139 1113.0856 1116.8701 1150.3138 1157.8044 1176.7197 1181.0489 1213.6399 1220.3969 1241.5064 1282.0964 1303.6359 1309.5079 1371.3893 1427.4336 1437.3735 1458.2944 1467.0299 1475.0536 1477.2622 1501.0678 1518.3210 1596.3387 1633.3603 1680.2720 2954.1334 2990.2582 3036.2643 3039.1015 3048.5867 3111.0616 3122.4865 3124.7830 3158.4955 3163.1581 3181.5673 3554.6080
redmass: 2.0618 4.3064 4.6102 3.5061 5.1217 4.4353 3.9103 2.5295 10.0140 1.3489 4.4158 4.3898 3.0572 5.4742 9.5622 1.5857 5.2829 1.7579 8.0365 8.3314 7.1306 5.9279 3.6438 6.5586 1.3712 2.8041 1.5843 6.1427 1.4662 4.3925 1.3795 5.2187 1.3021 8.1426 1.3872 2.7023 1.2602 1.3478 1.1842 1.3289 2.8599 1.3999 1.0630 2.5483 1.2932 2.4690 1.2732 1.3476 5.9558 3.8442 1.1789 1.0841 1.0501 1.0784 1.0841 2.1696 2.0540 4.6204 6.3753 8.4856 1.0332 1.0583 1.1059 1.1036 1.0564 1.0897 1.0989 1.1108 1.0898 1.0932 1.0963 1.0764
irintensity: 0.3021 2.2613 0.6976 1.4848 0.5064 6.7551 4.7474 5.8315 3.2256 1.2008 3.4795 8.1736 0.0065 12.7863 4.3716 91.3252 38.0197 6.1005 5.9088 10.9483 0.2214 5.3671 0.0051 0.7147 31.1915 26.9423 20.0714 11.7064 61.9439 0.4399 1.1040 167.9952 1.3079 55.4085 2.1068 37.9628 0.2273 29.5450 0.0054 1.4584 12.7642 49.3647 0.2419 237.2597 20.7396 13.4344 0.3903 23.2121 114.8545 5.5524 17.1351 2.8006 12.9776 105.1941 1.4034 131.0564 437.1049 32.0832 0.2662 420.8888 84.9740 60.6372 17.9910 55.1231 45.9999 23.7585 24.2507 18.1738 4.7278 12.9405 11.8716 29.7580
temp: 298.150 k
press: 1.00000 atm
elementType: 16 8 7 7 6 6 6 6 6 6 6 6 6 6 1 1 1 1 1 1 1 1 1 1 1 1
symmnumber: 1
zpe: 536601.3 jmol-1
zpe.correction: 0.204381 hartree
zpe.thermalcorrener: 0.217009 hartree
zpe.thermalcorrenthalpy: 0.217953 hartree
zpe.thermalcorrgfe: 0.164384 hartree
zpe.sumelectzpe: -969.998501 hartree
zpe.sumelectthermal: -969.985873 hartree
zpe.sumelectthermalent: -969.984929 hartree
zpe.sumelectthermalfe: -970.038498 hartree
dipole: -0.0528 -1.6073 0.0128
dipole: 1.6083
quadrupole: -67.6956 -84.7747 -94.4611
quadrupole: 14.5212 -0.0085 0.0052
quadrupole: 14.6149 -2.4642 -12.1507 14.5212 -0.0085 0.0052
hfenergy: -970.2028821 hartree
pointgroup: C01 [X(C10H12N2O1S1)]
dipole: 0.0382165 0.6314917 -0.0106184 debye
dipolederiv: -0.7960484 0.2093018 -0.0216532 0.2184622 -0.333563 0.0110807 -0.0222494 0.0104449 -0.117689 -1.9846345 0.0433307 -0.0456777 0.2726075 -0.321111 0.0076407 -0.0521572 0.0015625 -0.2999209 -2.223837 -0.1946818 -0.0422422 -0.1257089 -0.3728868 -0.0012511 -0.0429482 -0.0021785 -0.309284 -0.950327 0.1289887 -0.0190834 -0.3671361 -1.0742924 0.0108279 -0.0055197 0.0236643 -0.3035626 0.1077546 0.1244025 -0.0047894 0.3398107 -0.0415766 0.01256 -0.0106851 0.0075508 0.1629626 0.5245313 0.0586105 0.0050747 0.0286988 0.3885145 -0.0020778 0.0054057 -0.001045 0.2671957 2.2950937 -0.0932974 0.0557624 0.545362 1.1747179 -0.0146901 0.0385041 -0.0312244 0.0838732 1.34149 -0.1310563 0.0351103 -0.6004685 -0.0708809 -0.0108375 0.0475378 0.0005405 0.0840647 -0.1697304 0.1522052 -0.0027249 -0.1379565 0.101173 -0.011333 0.0046388 -0.0038597 -0.1988769 -0.1238563 -0.1086741 0.0038887 0.2266704 0.0142813 0.0013272 -0.004924 -0.0073771 -0.1588413 1.49839 -0.250991 0.0441113 -0.6143411 0.0206777 -0.0150749 0.0538488 -0.0053894 0.0791673 -0.2022539 -0.0793169 0.0017719 0.3849983 -0.017134 0.0057076 -0.0099219 -0.0065213 -0.1953962 -0.321622 0.1316746 -0.0074095 -0.2127084 0.1266892 -0.0128287 0.0006977 -0.0039823 -0.1652051 0.8357311 0.0948802 0.0109726 0.4897329 0.2914023 0.0141307 0.001503 0.0037052 0.3352103 -0.0498092 -0.0275858 -0.0858106 -0.0672125 0.0546338 -0.0192941 -0.1291298 -0.0067463 -0.0334623 -0.0584093 -0.0230596 0.0859102 -0.061229 0.0551209 0.0121715 0.1319275 0.0013166 -0.0261422 -0.0380099 -0.0562317 0.023572 -0.0457242 -0.0301043 0.0910909 0.0945233 0.1406715 -0.0553635 -0.0333448 -0.051285 -0.0204533 -0.0460792 -0.0419029 -0.0941178 -0.0915519 -0.1443116 -0.049259 0.1528728 0.0106683 -0.0042372 0.0394882 0.156152 0.0048926 -0.0052032 0.0040207 0.3092591 0.0503878 0.0885893 -0.0053179 0.0755424 -0.1045704 0.0088373 -0.0049597 0.0091795 0.1647494 0.1992943 -0.0689792 0.0021971 -0.0664201 0.0725753 0.0007589 0.0021764 0.0007362 0.1689958 -0.0404917 -0.097125 -0.0029321 -0.1130724 0.0193965 0.0007546 -0.002634 0.0012277 0.166744 0.0774041 0.0391998 -0.0032102 0.0603076 -0.0510948 0.0069736 -0.0037957 0.0065821 0.1630866 -0.1352013 0.0737496 -0.0087607 0.1267139 0.0364153 0.0055326 -0.0101742 0.0041521 0.1220863 0.0223165 0.0173654 0.0417316 -0.1728291 -0.0319781 -0.1281025 -0.0322958 -0.11337 -0.0915127 0.0223095 0.0093172 -0.0358005 -0.1775088 -0.0206546 0.1153208 0.0473866 0.110651 -0.1028792 unknown
polarizability: 247.4200589|2.6864774|140.7317338|4.4235676|-1.8334323|68.3696913 unknown
InChI: InChI=1S/C10H12N2OS/c1-13-9-4-2-8(3-5-9)12-10-11-6-7-14-10/h2-5,12H,6-7H2,1H3
charge 0 multiplicity 1
26 atoms
S  -3.916003 1.373676 -0.087052
O  4.187707 -0.826185 0.174909
N  -1.162153 1.035888 -0.012867
N  -2.493991 -0.971503 0.008776
C  -4.92178 -0.227984 -0.063989
C  -3.89214 -1.428646 -0.011506
C  -2.342296 0.31827 -0.021988
C  0.17449 0.543933 0.034183
C  1.225968 1.494459 0.037589
C  0.491786 -0.841893 0.077199
C  2.884647 -0.295865 0.126452
C  2.575528 1.086142 0.083289
C  1.836473 -1.247794 0.122704
C  5.298178 0.125818 0.182199
H  -5.536081 -0.254934 -0.976359
H  -5.571299 -0.206687 0.823802
H  -4.079722 -2.039963 0.891212
H  -4.039503 -2.084119 -0.890374
H  -1.256369 2.051915 -0.041923
H  0.994787 2.567245 0.004221
H  -0.320962 -1.571005 0.074357
H  3.362064 1.846324 0.084692
H  2.096171 -2.310468 0.156543
H  6.207824 -0.491423 0.222222
H  5.258132 0.787577 1.070159
H  5.307744 0.743721 -0.737653
