program: Gaussian 09
title: 000291793
version: EM64L-G09RevD.01
frameworkgroup: C1[X(C14H12N2O6)]
method: RPBEPBE
basis: SDD
operation: Freq
keyword: #p
keyword: freq=noraman
keyword: PBEPBE/SDD
title: #p freq=noraman PBEPBE/SDD
converged: YES YES NO NO
title: Mulliken charges:
elementType: O O O O O O N N C C C C C C C C C C C C C C H H H H H H H H H H H H
charge: -0.245461 -0.245489 -0.414819 -0.414819 -0.243657 -0.243652 -0.483265 -0.483259 0.286643 0.286579 -0.314810 -0.314775 -0.247344 -0.247393 0.247997 0.248042 -0.300596 -0.300598 -0.210203 -0.210199 0.171638 0.171636 0.314073 0.314102 0.286711 0.286729 0.235266 0.235263 0.240323 0.240329 0.292378 0.292374 0.385127 0.385130
chargesum: 0.00000
title: Mulliken charges with hydrogens summed into heavy atoms:
elementType: O O O O O O N N C C C C C C C C C C C C C C
charge: -0.245461 -0.245489 -0.029691 -0.029689 -0.243657 -0.243652 -0.196554 -0.196530 0.286643 0.286579 -0.000737 -0.000673 -0.012078 -0.012130 0.247997 0.248042 -0.060273 -0.060268 0.082175 0.082175 0.171638 0.171636
polarizability: 3.69838720e+02 -8.01969512e-04 3.08023239e+02 1.66672230e-01 -8.83743580e-03 7.28250805e+01
1716.lowfreq: -164.6127 -5.2494 -2.5741 -1.3062 0.0002 0.0005 0.0009 21.1353 29.6963
frequency: -164.6099 21.0526 29.6962 30.9603 41.3712 44.7588 65.4114 69.5699 116.1272 130.5795 154.8412 163.7859 181.3711 187.9598 205.6096 218.5450 228.8926 296.8340 297.2958 302.8369 328.4105 402.3158 411.0291 452.6649 474.2164 483.0413 546.3014 573.5179 577.0998 578.4316 579.8399 590.0960 594.6671 600.7056 651.1877 651.9448 710.7452 727.6653 727.6890 734.5885 757.5359 781.1811 820.1390 832.3061 902.9099 905.4753 906.0593 920.4538 924.7980 966.3844 968.1570 986.6431 990.4606 991.8289 1003.4070 1053.3830 1055.6949 1060.7883 1098.7314 1144.4010 1149.2487 1182.8402 1215.3879 1218.0537 1218.4587 1278.1506 1292.2518 1315.1101 1315.6672 1328.3364 1329.4276 1358.4026 1431.2494 1461.9753 1480.6385 1522.7308 1591.7012 1599.2528 1612.7506 1629.0815 1629.3904 1631.9528 1659.6078 1661.3201 3100.5982 3100.7227 3144.3439 3165.2337 3170.0978 3170.1249 3195.0890 3198.1827 3521.0929 3521.1860 3547.1849 3550.4847
redmass: 2.0879 7.2077 9.0187 8.1761 7.5134 10.3011 7.9936 6.7249 4.3074 7.2951 4.7048 3.1728 6.5985 2.7946 9.3525 2.7023 7.7784 11.3771 8.9622 8.1847 3.6401 2.0086 6.6848 5.2968 3.1884 4.7200 3.2868 1.6546 1.7599 6.2331 6.1652 5.2894 1.2349 6.0551 1.9438 1.9868 7.1296 8.0326 8.7091 5.2447 6.3694 1.2508 5.5031 5.4876 1.4572 1.9375 2.1792 5.9826 5.1931 4.1986 4.3205 1.3376 1.0912 1.0907 1.2960 2.2188 2.3144 2.1087 2.4964 1.9073 2.1851 1.0640 1.5210 1.5068 1.4625 2.4906 1.5873 1.6789 1.8934 2.4287 2.4026 6.8990 2.3331 2.6307 2.0150 2.2999 6.6925 7.8876 4.5911 8.7825 2.8200 8.6882 6.1995 5.2168 1.0919 1.0919 1.0872 1.0954 1.0928 1.0928 1.0940 1.0964 1.0641 1.0642 1.0766 1.0733
irintensity: 0.0008 1.5458 0.0172 0.0001 4.6768 0.0001 0.1850 14.8445 0.0008 5.3076 0.9860 0.0000 3.2807 2.9247 1.6936 0.0002 3.3859 1.8619 3.0371 0.7180 3.6534 0.0010 0.9466 109.1148 31.3900 20.0792 0.0000 137.7214 0.0066 46.1240 27.4657 15.2157 108.4055 2.3598 164.1309 0.0274 0.1475 70.9380 0.2085 0.0000 19.0072 115.9498 10.4471 5.2404 0.0000 0.0002 6.3919 2.5232 12.2774 3.5508 22.6051 19.2424 0.0026 118.7039 0.0001 56.0859 797.0175 94.7906 33.9058 34.1903 10.2051 3.9765 10.0636 48.2974 31.9939 2.4796 22.0755 144.2949 78.8868 275.2511 87.8551 16.2489 294.8632 8.3009 327.7360 49.8732 13.4351 252.4788 85.1869 12.7353 51.8581 357.5708 68.3487 86.1529 5.5925 1.0336 3.6102 22.3199 5.5204 1.2953 11.3512 11.8005 83.3960 59.4678 15.0357 0.4079
temp: 298.150 k
press: 1.00000 atm
elementType: 8 8 8 8 8 8 7 7 6 6 6 6 6 6 6 6 6 6 6 6 6 6 1 1 1 1 1 1 1 1 1 1 1 1
symmnumber: 1
zpe: 638517.1 jmol-1
zpe.correction: 0.243198 hartree
zpe.thermalcorrener: 0.263586 hartree
zpe.thermalcorrenthalpy: 0.264530 hartree
zpe.thermalcorrgfe: 0.190454 hartree
zpe.sumelectzpe: -1099.969039 hartree
zpe.sumelectthermal: -1099.948652 hartree
zpe.sumelectthermalent: -1099.947708 hartree
zpe.sumelectthermalfe: -1100.021783 hartree
dipole: 0.0008 -1.4714 0.0004
dipole: 1.4714
quadrupole: -125.7648 -123.0458 -130.0889
quadrupole: 0.0008 -0.0534 0.0015
quadrupole: 0.5350 3.2540 -3.7890 0.0008 -0.0534 0.0015
hfenergy: -1100.2122376 hartree
pointgroup: C01[X(C14H12N2O6)]
dipole: -0.0021328 0.5788813 0.0001543 debye
polarizability: 369.8381078|0.1945838|308.0238513|-0.1666993|0.0083106|72.8250805 unknown
InChI: InChI=1S/C14H12N2O6/c17-11(5-7-13(19)20)15-9-3-1-2-4-10(9)16-12(18)6-8-14(21)22/h1-8,15-16,19,21H
charge 0 multiplicity 1
34 atoms
O  3.703463 -1.387804 -0.005684
O  -3.693383 -1.411203 0.00524
O  6.204249 3.021562 -0.000553
O  -6.222414 2.982104 0.000668
O  4.006012 3.794378 0.005475
O  -4.02918 3.76901 -0.004993
N  1.440433 -0.686072 0.000444
N  -1.434956 -0.694986 -0.000548
C  0.727764 -1.920384 -0.000262
C  -0.714617 -1.924811 0.000127
C  1.424595 -3.157729 -0.000943
C  -1.403807 -3.166422 0.000781
C  0.719952 -4.376607 -0.000625
C  -0.691666 -4.380937 0.000434
C  2.831014 -0.469088 -0.001804
C  -2.826881 -0.486876 0.001482
C  3.182833 0.982209 0.00076
C  -3.187995 0.962149 -0.000785
C  4.480913 1.392158 -0.000867
C  -4.48867 1.363786 0.000841
C  4.816352 2.834921 0.001728
C  -4.833352 2.804377 -0.00146
H  2.515085 -3.139202 -0.001557
H  -2.494397 -3.154609 0.001366
H  0.902805 0.180935 0.004112
H  -0.902821 0.175403 -0.003972
H  1.279409 -5.317487 -0.001057
H  -1.245345 -5.32523 0.00084
H  2.390889 1.745631 0.00405
H  -2.400963 1.730641 -0.00385
H  5.298132 0.663904 -0.004105
H  -5.301219 0.630321 0.00386
H  6.407971 3.996172 0.001255
H  -6.432406 3.955386 -0.000998
