program: Gaussian 09
title: 000291812
version: EM64L-G09RevD.01
frameworkgroup: C1[X(C13H17NO5S)]
method: RPBEPBE
basis: SDD
operation: Freq
keyword: #p
keyword: freq=noraman
keyword: PBEPBE/SDD
title: #p freq=noraman PBEPBE/SDD
converged: YES YES NO NO
title: Mulliken charges:
elementType: S O O O O O N C C C C C C C C C C C C C H H H H H H H H H H H H H H H H H
charge: 0.416186 -0.382115 -0.292218 -0.243992 -0.262000 -0.225665 -0.365325 0.452652 0.116903 -0.489827 -0.259333 -0.782974 0.222637 0.269531 0.212008 -0.250635 -0.252852 -0.657098 -0.788668 -0.664916 0.283583 0.242461 0.240822 0.395364 0.247334 0.216682 0.224536 0.233501 0.221423 0.255534 0.219525 0.242903 0.269118 0.241371 0.248650 0.229503 0.215392
chargesum: 0.00000
title: Mulliken charges with hydrogens summed into heavy atoms:
elementType: S O O O O O N C C C C C C C C C C C C C
charge: 0.416186 -0.382115 -0.292218 -0.243992 -0.262000 -0.225665 0.030039 0.452652 0.116903 -0.489827 -0.259333 -0.016108 0.222637 0.269531 0.212008 0.213381 0.205184 0.039385 -0.035276 0.028628
polarizability: 2.83964933e+02 -5.19759669e+00 2.26011584e+02 -6.67294739e-01 3.14503573e+00 1.03891407e+02
1716.lowfreq: -60.3630 -3.6905 -0.0017 -0.0008 0.0014 1.9108 5.0449 29.2169 35.7504
frequency: -60.3560 29.2129 35.7478 38.5863 58.1029 65.8710 74.0137 86.5515 92.5174 97.3458 113.8701 122.3163 157.9502 171.8874 176.5082 216.8424 226.2046 241.6165 260.2984 271.9165 287.9115 312.0758 323.8753 335.1297 351.1776 394.2535 405.9144 423.9773 439.3339 484.7299 534.0170 536.9128 586.7846 607.7788 624.4008 692.7468 696.1775 714.5661 718.1225 742.0200 790.1284 810.4007 819.1510 820.8292 856.0528 868.2588 922.2249 969.2648 978.3802 998.1320 1012.4981 1035.2237 1035.7736 1041.7687 1044.6837 1095.3023 1096.7558 1138.7016 1153.1746 1154.7594 1210.6073 1238.1201 1279.4096 1279.7392 1330.5942 1353.6798 1355.3020 1376.5109 1381.8490 1389.6488 1392.6988 1400.9043 1431.4416 1445.7818 1453.7766 1455.7113 1456.6237 1463.3992 1463.6144 1465.0043 1477.0769 1482.9121 1484.5008 1526.1540 1556.6007 1604.9419 1625.4007 1633.1662 2992.2346 2992.5300 2993.6872 2998.8563 3029.4798 3033.4938 3073.5070 3077.4046 3086.6895 3087.8117 3093.2111 3095.5723 3119.0356 3119.4065 3132.6850 3139.0021 3294.5741
redmass: 1.0296 3.8850 3.1869 3.1711 4.5809 5.4106 6.0863 4.4684 3.8921 4.6833 5.6623 2.9489 1.0370 2.6940 4.9982 1.3025 1.5511 4.6652 5.2490 5.1216 3.0722 3.7377 3.5659 3.5242 6.3037 7.2681 7.0763 4.0852 3.9519 6.3346 4.9162 5.9013 3.4195 4.6055 6.9205 4.0304 5.8256 7.6357 4.5927 7.1348 1.8927 1.3193 2.2310 3.5254 1.1518 3.5643 4.1026 5.3684 1.9787 2.5919 2.6478 1.6596 3.1983 1.5257 3.4525 2.1659 2.1689 3.7191 1.7789 1.6871 4.8084 4.2099 1.1154 1.1169 3.1453 1.3997 1.3932 3.4698 1.3217 1.2319 1.2315 1.2109 2.3797 1.2443 1.2169 1.1191 1.1354 1.0513 1.0441 1.0463 1.0463 1.0513 1.0519 2.9319 5.0382 8.9232 4.9546 9.7199 1.0361 1.0382 1.0363 1.0379 1.0594 1.0587 1.0955 1.0981 1.0991 1.0972 1.1034 1.1025 1.1058 1.1059 1.1003 1.0985 1.0796
irintensity: 0.4644 2.5303 0.2424 0.4671 0.5986 0.6468 4.6419 0.6744 2.3165 1.4225 7.6235 2.1926 0.4918 2.7283 0.5775 1.9713 1.5166 4.0377 0.5506 1.6412 1.4327 1.2374 7.6724 21.9848 10.8170 5.9885 11.2810 1.8851 4.7498 2.1439 11.4331 2.0165 2.0575 1.1385 7.9042 6.1275 13.5402 8.8542 4.4068 3.1795 19.7636 4.5931 9.3399 2.0897 85.7793 45.5814 103.0075 20.8940 79.5913 11.2997 173.1369 8.7000 167.5859 6.9462 180.8696 50.9217 19.9314 313.7709 14.2909 23.8702 214.6652 197.9199 3.6579 2.0013 134.6027 9.4366 2.4518 179.3671 135.0133 25.3371 32.5945 29.8899 193.3142 52.5952 22.2630 36.1288 11.0654 30.3210 13.0244 19.5423 15.4251 15.6405 12.9612 415.4295 344.7739 250.1096 75.8302 280.9927 24.9368 4.6095 19.7913 8.3277 37.8940 35.8100 9.1173 11.2168 31.4952 42.8882 0.4299 8.9100 27.3670 25.6349 3.2850 6.8720 262.6157
temp: 298.150 k
press: 1.00000 atm
elementType: 16 8 8 8 8 8 7 6 6 6 6 6 6 6 6 6 6 6 6 6 1 1 1 1 1 1 1 1 1 1 1 1 1 1 1 1 1
symmnumber: 1
zpe: 746260.9 jmol-1
zpe.correction: 0.284236 hartree
zpe.thermalcorrener: 0.305908 hartree
zpe.thermalcorrenthalpy: 0.306852 hartree
zpe.thermalcorrgfe: 0.231748 hartree
zpe.sumelectzpe: -1333.036906 hartree
zpe.sumelectthermal: -1333.015234 hartree
zpe.sumelectthermalent: -1333.014290 hartree
zpe.sumelectthermalfe: -1333.089394 hartree
dipole: -4.9882 1.3935 0.5498
dipole: 5.2082
quadrupole: -88.9834 -139.2249 -124.0167
quadrupole: -2.2128 0.5025 -1.1943
quadrupole: 28.4250 -21.8165 -6.6084 -2.2128 0.5025 -1.1943
hfenergy: -1333.3211421 hartree
pointgroup: C01 [X(C13H17N1O5S1)]
dipole: -1.9435811 0.6458346 0.064107 debye
polarizability: 283.5309064|-6.9104375|221.9662334|2.2212161|-23.2062521|108.3707835 unknown
InChI: InChI=1S/C13H17NO5S/c1-5-18-12(16)9-7(3)10(13(17)19-6-2)20-11(9)14-8(4)15/h14H,5-6H2,1-4H3
charge 0 multiplicity 1
37 atoms
S  1.081411 1.350426 -0.462176
O  -3.195675 -0.355587 -0.157189
O  3.760011 0.469805 -0.315376
O  -2.264225 -2.457782 0.241865
O  3.53383 -1.813903 0.144616
O  -0.421596 3.675266 -0.900323
N  -1.674548 1.744574 -0.53874
C  0.484373 -1.241017 0.023032
C  -0.788483 -0.543284 -0.109897
C  1.572923 -0.382004 -0.136245
C  -0.634267 0.84309 -0.368811
C  0.608998 -2.720011 0.298794
C  -2.078839 -1.237879 0.016883
C  3.003841 -0.691713 -0.075245
C  -1.551323 3.11871 -0.796532
C  -4.550562 -0.97524 -0.022143
C  5.243738 0.324561 -0.256481
C  -4.999181 -0.997264 1.441016
C  -2.878355 3.84892 -0.938756
C  5.747751 0.490347 1.180351
H  1.665997 -3.016246 0.345924
H  0.091243 -3.30359 -0.482738
H  0.10584 -2.980095 1.24698
H  -2.607045 1.29923 -0.456919
H  -4.502385 -1.993383 -0.443723
H  -5.19562 -0.336947 -0.6484
H  5.609084 1.125897 -0.918528
H  5.515639 -0.664201 -0.665996
H  -6.029257 -1.394116 1.506882
H  -4.342086 -1.648907 2.040099
H  -4.992798 0.016874 1.877083
H  -3.468295 3.438632 -1.778883
H  -2.68005 4.913155 -1.129011
H  -3.483974 3.755447 -0.018687
H  5.377594 -0.327495 1.820902
H  5.418144 1.454976 1.60307
H  6.853452 0.465954 1.192808
