program: Gaussian 09
title: 000291803
version: EM64L-G09RevD.01
frameworkgroup: C1[X(C16H12N2O6)]
method: RPBEPBE
basis: SDD
operation: Freq
keyword: #p
keyword: freq=noraman
keyword: PBEPBE/SDD
title: #p freq=noraman PBEPBE/SDD
converged: YES YES NO NO
title: Mulliken charges:
elementType: O O O O O O N N C C C C C C C C C C C C C C C C H H H H H H H H H H H H
charge: -0.312515 -0.311990 -0.435357 -0.435062 -0.292505 -0.291969 -0.353935 -0.353404 0.119559 0.120178 0.138875 0.139347 0.152178 0.151513 -0.318271 -0.318575 -0.306877 -0.306977 -0.223967 -0.223970 -0.226936 -0.226916 0.156013 0.155241 0.296458 0.296113 0.284254 0.283982 0.447102 0.446712 0.240338 0.240310 0.240521 0.240510 0.395074 0.394950
chargesum: 0.00000
title: Mulliken charges with hydrogens summed into heavy atoms:
elementType: O O O O O O N N C C C C C C C C C C C C C C C C
charge: -0.312515 -0.311990 -0.040283 -0.040112 -0.292505 -0.291969 0.093167 0.093308 0.119559 0.120178 0.138875 0.139347 0.152178 0.151513 -0.021813 -0.022461 -0.022623 -0.022995 0.016371 0.016340 0.013584 0.013594 0.156013 0.155241
polarizability: 3.99491189e+02 -3.90445630e+01 2.47231961e+02 1.40789706e-02 1.03265154e-02 8.66926978e+01
1716.lowfreq: -4.0048 -2.6429 0.0003 0.0007 0.0008 2.9970 12.2244 22.2982 27.4035
frequency: 12.1800 22.1433 27.4016 50.1098 58.4420 64.5687 107.4546 108.1862 115.1216 125.2840 183.1713 199.6759 214.3922 260.7558 265.5899 293.1823 325.4596 340.5619 347.4624 386.2519 396.2251 413.5798 424.6363 429.8281 461.5106 481.7371 490.9739 544.0274 556.9432 599.9809 600.0052 617.9811 620.0963 643.3674 646.8247 661.9401 671.4613 699.2931 700.9341 751.0687 769.2994 774.7392 775.0869 796.5382 796.9031 808.2266 919.4510 919.8559 925.2769 954.7768 980.8141 997.1033 997.4928 1012.7225 1015.8236 1020.0497 1020.7348 1047.0719 1049.6354 1086.2712 1087.3983 1110.6655 1133.4534 1154.7636 1157.1132 1180.7621 1181.0078 1190.9364 1230.9364 1270.6619 1273.3580 1276.2565 1327.0077 1328.7994 1372.8125 1375.2923 1415.2916 1418.1040 1442.3300 1470.7611 1471.5509 1506.6801 1510.4420 1547.8542 1567.6003 1581.8250 1606.4119 1607.4982 1620.8117 1634.2241 3088.1374 3095.1807 3139.4124 3139.4223 3157.1835 3157.2268 3169.1891 3169.3293 3189.2636 3189.4662 3527.8334 3527.9389
redmass: 6.5363 9.7974 6.9638 7.1259 9.6944 11.7248 5.1333 4.6495 11.2526 7.5923 5.9442 7.2291 5.5000 7.6347 6.3997 6.7538 6.6901 8.4617 8.7534 9.4292 8.2989 5.9841 3.5215 4.0367 4.4871 4.7763 6.2384 6.0889 5.7556 1.2797 1.2840 5.1304 5.2176 6.2170 5.7426 4.3083 4.4386 3.4136 3.4518 5.6919 5.8219 3.9009 4.0830 1.5701 1.5646 6.9259 1.4047 1.3991 6.4924 1.0823 1.1103 1.3790 1.3779 5.4876 5.2071 1.3574 1.3560 3.2065 2.9047 3.4491 2.9800 2.1502 1.7710 1.9087 1.9010 1.0811 1.0698 2.6687 2.8686 1.8555 1.6157 1.5174 2.6731 2.6900 9.0940 10.1212 2.0096 2.0305 2.1229 2.4670 2.5637 2.2285 8.8904 6.0013 6.5194 8.1323 5.9634 5.9192 6.6571 4.4852 1.0873 1.0988 1.0868 1.0868 1.0916 1.0916 1.0966 1.0966 1.0958 1.0958 1.0641 1.0641
irintensity: 0.0492 0.2664 3.4629 2.8772 0.0621 2.8423 1.2570 0.3255 5.4037 0.1013 0.2529 0.0472 1.4321 3.5329 0.0698 63.1568 10.2529 2.9102 0.0033 1.1614 9.1565 0.9043 4.4426 18.8608 0.5395 11.9010 4.6616 0.0460 52.9764 75.0943 129.3447 92.5090 11.8496 1.0047 0.0174 0.0975 0.2715 201.2049 8.9449 24.0953 0.3480 18.5941 0.7760 73.5144 7.3313 5.9612 0.3467 0.7748 9.7516 30.2895 250.8149 4.8505 4.9164 459.3484 15.1593 2.0973 2.1648 35.7846 0.3894 6.4167 132.3141 9.6115 61.2684 15.9293 195.6062 0.1393 8.0381 0.8178 0.0818 22.9324 2.4979 0.4143 11.7548 135.6440 59.7372 3.1115 53.5413 0.1379 869.1615 0.7828 18.2504 0.1809 475.6442 0.7651 4.8419 0.6375 16.5886 1.6808 372.7730 2.2871 1006.4204 52.7264 10.0635 0.9667 4.6775 7.8376 32.7834 11.9555 10.0671 7.7889 123.3175 8.2578
temp: 298.150 k
press: 1.00000 atm
elementType: 8 8 8 8 8 8 7 7 6 6 6 6 6 6 6 6 6 6 6 6 6 6 6 6 1 1 1 1 1 1 1 1 1 1 1 1
symmnumber: 1
zpe: 677025.8 jmol-1
zpe.correction: 0.257866 hartree
zpe.thermalcorrener: 0.278272 hartree
zpe.thermalcorrenthalpy: 0.279217 hartree
zpe.thermalcorrgfe: 0.205413 hartree
zpe.sumelectzpe: -1176.087409 hartree
zpe.sumelectthermal: -1176.067002 hartree
zpe.sumelectthermalent: -1176.066058 hartree
zpe.sumelectthermalfe: -1176.139861 hartree
dipole: 0.0069 -0.0004 0.1781
dipole: 0.1783
quadrupole: -85.9062 -126.6724 -139.9002
quadrupole: 4.1337 0.0817 -0.1442
quadrupole: 31.5867 -9.1795 -22.4072 4.1337 0.0817 -0.1442
hfenergy: -1176.3452744 hartree
pointgroup: C01 [X(C16H12N2O6)]
dipole: -0.0026232 -0.0700929 0.0001087 debye
polarizability: 406.512843|0.3568253|86.6953517|-20.1500661|0.5637518|240.2076523 unknown
InChI: InChI=1S/C16H12N2O6/c19-13(9-5-1-3-7-11(9)15(21)22)17-18-14(20)10-6-2-4-8-12(10)16(23)24/h1-8,17-18,21,23H
charge 0 multiplicity 1
36 atoms
O  -1.303939 0.263793 1.993146
O  1.304453 0.230368 -1.994966
O  -4.003042 -0.644264 -3.188773
O  4.00248 -0.624323 3.189751
O  -1.897963 -0.103192 -2.480177
O  1.899239 -0.071814 2.483255
N  -0.662952 0.225065 -0.21157
N  0.662479 0.232075 0.210091
C  -3.116332 0.271055 0.369894
C  3.115628 0.276507 -0.371223
C  -3.789148 0.045426 -0.887917
C  3.788736 0.061432 0.888084
C  -1.63931 0.240144 0.756404
C  1.639071 0.233944 -0.757862
C  -3.933801 0.535749 1.50532
C  3.932244 0.538129 -1.507918
C  -5.215398 0.089357 -0.933227
C  5.214667 0.11203 0.934079
C  -5.337036 0.591758 1.437806
C  5.33516 0.6017 -1.439789
C  -5.988925 0.364268 0.205885
C  5.987431 0.384395 -0.206207
C  -3.119695 -0.224294 -2.189856
C  3.119499 -0.202681 2.191279
H  -3.409319 0.682097 2.454229
H  3.407791 0.675262 -2.458205
H  -5.702463 -0.095225 -1.893043
H  5.702042 -0.065209 1.895153
H  -0.847244 0.176144 -1.242229
H  0.8464 0.200479 1.241356
H  -5.915628 0.806991 2.342493
H  5.91328 0.814565 -2.345334
H  -7.080697 0.397762 0.132753
H  7.078995 0.42355 -0.132746
H  -3.480649 -0.779547 -4.024877
H  3.481347 -0.753296 4.027637
