program: Gaussian 09
title: 000291801
version: EM64L-G09RevD.01
frameworkgroup: C1[X(C16H17BrN2O3S)]
method: RPBEPBE
basis: SDD
operation: Freq
keyword: #p
keyword: freq=noraman
keyword: PBEPBE/SDD
title: #p freq=noraman PBEPBE/SDD
converged: YES YES NO NO
title: Mulliken charges:
elementType: Br S O O O N N C C C C C C C C C C C C C C C C H H H H H H H H H H H H H H H H H
charge: -0.006160 0.960054 -0.281798 -0.534600 -0.509232 -0.489592 0.019418 -0.030144 0.454253 -0.232443 -0.243302 -0.392779 -0.330609 0.278784 0.232769 -0.799111 -0.273597 -0.349674 -0.340779 -0.228027 -0.192687 -0.243873 -0.683731 0.281906 0.286543 0.244538 0.244734 0.299338 0.238375 0.239331 0.228476 0.287346 0.257651 0.252120 0.249798 0.213021 0.214151 0.213126 0.233786 0.232621
chargesum: 0.00000
title: Mulliken charges with hydrogens summed into heavy atoms:
elementType: Br S O O O N N C C C C C C C C C C C C C C C C
charge: -0.006160 0.960054 -0.281798 -0.534600 -0.509232 -0.190254 0.019418 -0.030144 0.454253 0.049463 0.043241 -0.148241 -0.085875 0.278784 0.232769 -0.092929 0.013749 -0.092023 -0.088659 -0.228027 0.057111 0.183299 -0.004199
polarizability: 3.61273527e+02 1.14687830e-01 3.10073916e+02 2.83040282e+00 4.30926851e+00 1.58751989e+02
1716.lowfreq: -42.7329 -4.0790 -3.6699 -0.0011 -0.0007 0.0012 0.9564 6.2034 12.8785
frequency: -42.7044 5.9147 12.8317 27.2299 39.6141 46.8743 57.4496 87.9073 98.7100 106.9194 120.7600 124.4942 132.8953 160.6977 184.5455 205.0598 214.5341 225.3919 233.4392 247.7555 258.3674 289.9351 297.6355 311.4459 344.2356 355.2054 376.3460 391.7045 400.5175 408.2336 420.7234 470.6086 477.0337 511.5229 540.5337 560.3631 584.8807 621.1279 623.0511 636.3021 707.9269 730.0252 743.2354 768.9781 777.1675 798.3687 815.8408 829.6802 831.9323 850.4016 890.2878 905.0948 913.1920 931.0317 939.2194 951.8272 964.8279 985.2838 987.8903 996.9493 1030.2259 1034.9829 1050.7570 1054.5792 1075.8082 1114.7621 1120.3350 1127.2448 1135.9721 1185.5718 1197.9563 1218.8569 1233.5754 1258.3310 1264.2580 1280.3878 1298.1410 1349.8792 1372.2620 1381.8928 1392.2516 1392.4058 1400.8516 1400.9652 1406.4218 1462.2477 1462.6762 1469.9997 1473.5610 1475.1472 1479.6103 1490.5701 1544.4425 1574.9527 1592.2192 1594.7981 1597.2608 2961.5073 2983.4277 2998.6977 3021.8557 3053.9314 3062.9995 3093.1696 3096.3361 3107.7930 3136.5472 3140.7351 3159.9587 3164.9471 3168.2331 3175.4049 3179.8442 3218.5957
redmass: 1.0267 6.5723 5.8914 4.9882 6.2735 4.6153 4.7729 4.2831 3.1973 6.4729 2.7932 5.5453 5.6598 5.8960 7.9493 3.0531 8.2858 7.8566 7.5567 1.1845 4.7043 5.1085 5.2816 5.2306 5.1166 4.1731 3.8492 7.4271 6.4218 2.8607 6.4376 3.2411 3.7638 3.1804 3.8445 4.2381 5.3537 6.9450 6.9508 4.5771 3.2697 3.3496 2.0730 4.4411 5.0202 1.4553 9.2840 1.3960 1.1198 1.2487 3.9171 3.3610 1.4457 1.4254 1.5130 11.9631 1.3143 1.4223 1.8850 2.7369 4.5915 2.8841 1.5848 2.5068 2.0787 2.3084 1.2887 2.0350 1.4375 1.1428 1.7201 3.0212 3.1811 1.3117 1.1397 1.2104 1.2614 2.0654 1.4107 4.4814 2.9491 3.2056 1.3322 1.2758 4.2781 2.2398 1.0406 1.0450 2.2987 1.1264 1.1084 1.1312 6.6654 7.0275 6.9760 6.2820 6.6109 1.0554 1.0375 1.0362 1.1078 1.0886 1.0975 1.0990 1.0989 1.1016 1.0897 1.0892 1.0879 1.0958 1.0966 1.0925 1.0965 1.0742
irintensity: 0.4775 1.7503 1.0621 0.2084 0.2150 0.1912 0.1903 0.5983 3.1730 2.0592 0.2095 1.2148 1.9486 4.5179 12.6039 26.4822 6.0216 13.0086 3.0632 0.6979 5.2681 1.1325 26.7176 1.4675 6.7648 3.7231 9.3904 12.9324 87.2634 0.3189 53.9570 35.1911 27.6665 69.9696 50.5454 6.2216 16.0996 0.0240 18.6795 24.3392 0.5330 2.8990 321.9718 47.7471 20.5591 53.2068 111.0358 29.3366 0.2151 1.8864 87.7245 3.7312 3.3385 7.8456 21.1173 68.1777 1.3574 1.0071 3.2875 4.2816 3.9689 86.9503 14.3378 25.7073 4.4206 8.0764 6.3369 95.1018 4.9994 15.7266 70.5334 7.5327 255.7773 29.5296 0.0383 2.3497 2.6912 31.2731 5.3752 3.4523 10.9130 13.3226 14.7921 32.4563 89.5305 143.9755 13.2815 14.4914 22.3139 16.2270 6.4631 2.4546 6.5851 8.9562 19.0695 13.2029 3.0936 51.7442 23.4354 21.9907 30.4013 22.4382 15.3252 17.6792 29.9569 32.3987 9.3936 10.4931 6.5580 1.4084 8.3000 0.5778 10.9859 6.1167
temp: 298.150 k
press: 1.00000 atm
elementType: 35 16 8 8 8 7 7 6 6 6 6 6 6 6 6 6 6 6 6 6 6 6 6 1 1 1 1 1 1 1 1 1 1 1 1 1 1 1 1 1
symmnumber: 1
zpe: 779080.6 jmol-1
zpe.correction: 0.296736 hartree
zpe.thermalcorrener: 0.320384 hartree
zpe.thermalcorrenthalpy: 0.321328 hartree
zpe.thermalcorrgfe: 0.238512 hartree
zpe.sumelectzpe: -1364.701702 hartree
zpe.sumelectthermal: -1364.678054 hartree
zpe.sumelectthermalent: -1364.677110 hartree
zpe.sumelectthermalfe: -1364.759926 hartree
dipole: 3.4285 0.8524 -4.7601
dipole: 5.9279
quadrupole: -113.8748 -150.1900 -160.8264
quadrupole: -33.2852 11.4839 7.6122
quadrupole: 27.7556 -8.5596 -19.1960 -33.2852 11.4839 7.6122
hfenergy: -1364.998438 hartree
pointgroup: C01 [X(C16H17Br1N2O3S1)]
dipole: 1.2568734 0.7640266 1.8098947 debye
polarizability: 360.2213861|9.3306684|280.7630432|5.8057965|-60.5244664|189.1150033 unknown
InChI: InChI=1S/C16H17BrN2O3S/c1-3-22-16-9-6-14(17)10-13(16)11-18-19-23(20,21)15-7-4-12(2)5-8-15/h4-11,19H,3H2,1-2H3
charge 0 multiplicity 1
40 atoms
Br 2.69225 -3.414295 1.693863
S  -2.679064 0.680487 -1.540405
O  3.581278 2.427749 -0.106165
O  -3.664326 1.885257 -2.01397
O  -2.097766 -0.419014 -2.587142
N  -1.247612 1.677233 -0.684687
N  -0.201732 0.88401 -0.3174
C  -3.406084 -0.222114 -0.068771
C  -4.529118 -1.584512 2.098249
C  -4.327446 0.463422 0.736182
C  -3.019604 -1.554783 0.146043
C  -4.888163 -0.237968 1.827143
C  -3.5945 -2.229719 1.243306
C  2.124995 0.555891 0.259898
C  3.449296 1.098474 0.315777
C  -5.132217 -2.330918 3.273886
C  1.918401 -0.787422 0.675198
C  1.018555 1.384303 -0.22363
C  4.528521 0.304309 0.77225
C  3.000838 -1.557739 1.123718
C  4.308109 -1.030112 1.178428
C  4.926348 3.042089 -0.080546
C  4.769802 4.470325 -0.593986
H  -4.606517 1.497326 0.510021
H  -2.31014 -2.043329 -0.528946
H  -5.613372 0.268709 2.473495
H  -3.312248 -3.270581 1.439563
H  -1.081275 2.518717 -1.284102
H  -5.674593 -3.233791 2.937016
H  -4.346992 -2.667737 3.975996
H  -5.84097 -1.700818 3.836704
H  0.90216 -1.187684 0.632909
H  1.24981 2.432754 -0.475629
H  5.543872 0.70626 0.817566
H  5.143021 -1.641797 1.531092
H  5.315027 3.026307 0.958032
H  5.608095 2.452844 -0.726907
H  5.75063 4.979224 -0.595982
H  4.372998 4.474238 -1.623328
H  4.080929 5.044005 0.049059
