program: Gaussian 09
title: 000291800
version: EM64L-G09RevD.01
frameworkgroup: C1[X(C16H14Br2N2O2)]
method: RPBEPBE
basis: SDD
operation: Freq
keyword: #p
keyword: freq=noraman
keyword: PBEPBE/SDD
title: #p freq=noraman PBEPBE/SDD
converged: YES YES NO NO
title: Mulliken charges:
elementType: Br Br O O N N C C C C C C C C C C C C C C C C H H H H H H H H H H H H H H
charge: -0.000958 -0.000967 -0.270789 -0.270797 -0.085673 -0.085691 0.273519 0.273531 0.222333 0.222300 -0.275006 -0.274978 -0.339915 -0.339925 -0.234137 -0.234143 -0.186167 -0.186165 -0.347219 -0.347209 -0.534626 -0.534607 0.295618 0.295627 0.248041 0.248030 0.250408 0.250408 0.281174 0.281167 0.225735 0.251756 0.225916 0.225745 0.225907 0.251756
chargesum: 0.00000
title: Mulliken charges with hydrogens summed into heavy atoms:
elementType: Br Br O O N N C C C C C C C C C C C C C C C C
charge: -0.000958 -0.000967 -0.270789 -0.270797 -0.085673 -0.085691 0.273519 0.273531 0.222333 0.222300 0.020612 0.020649 -0.091874 -0.091895 -0.234137 -0.234143 0.064241 0.064243 -0.066045 -0.066041 0.168781 0.168800
polarizability: 5.00791462e+02 3.16338879e+01 3.17451082e+02 2.83180612e-02 2.31770552e-02 9.11172251e+01
1716.lowfreq: -2.6210 -2.2949 -0.0005 0.0004 0.0005 4.9038 10.0160 22.4492 32.2027
frequency: 10.0158 22.4492 32.2027 54.7246 71.2692 74.1117 86.8461 116.9718 122.9241 135.6503 154.7506 156.1801 168.8188 197.6397 219.3647 221.3195 229.3858 249.3241 254.6390 268.0317 308.4948 313.7423 325.2631 349.9235 365.6233 411.3984 426.9050 471.8627 488.8704 524.3500 556.7189 565.6180 568.6953 598.8180 602.7658 622.0800 652.2585 733.1316 739.6281 759.5595 772.6657 806.2782 806.4065 882.7857 898.2699 924.6947 925.7279 941.4959 942.7642 974.3829 983.9157 984.9745 985.7199 996.1461 1071.7362 1072.7706 1112.7792 1112.8204 1119.6329 1125.3897 1152.2516 1152.7564 1198.7371 1202.1364 1231.6793 1238.1204 1260.2865 1260.4530 1294.7611 1333.8125 1377.0059 1379.3499 1400.1828 1405.7943 1435.1237 1436.7017 1461.0171 1461.3300 1469.1727 1469.1995 1475.3466 1475.5634 1496.2692 1560.7391 1571.5112 1590.3887 1593.3586 1593.9920 2966.1750 2966.3867 3058.0913 3058.1272 3085.8116 3089.0945 3131.7504 3131.7577 3159.3585 3159.3893 3171.6245 3171.6706 3179.2592 3179.2979
redmass: 8.9592 8.9716 5.7661 21.8435 4.0023 3.9715 4.0087 4.7915 4.6552 4.8779 5.5970 6.3622 2.8884 5.7757 6.4180 1.4010 1.1699 9.0910 2.1264 9.9124 6.0665 4.4667 4.5947 4.0815 4.4820 6.5274 6.5911 3.0669 3.3483 5.8595 3.8880 4.6284 4.4699 7.0337 6.1856 6.0805 6.0812 3.3997 3.4266 5.8440 6.1243 1.5115 1.5251 5.3410 5.1058 1.3827 1.3961 1.3458 1.3559 7.5622 8.8288 8.2763 1.5324 1.5137 2.0006 2.0274 1.2566 1.2566 2.2984 2.0063 1.4119 1.4262 1.5195 1.5622 4.0119 3.5076 1.3321 1.3288 1.4900 2.0218 9.3060 5.8098 3.7613 3.9117 1.2838 1.3170 1.7045 1.8042 1.0501 1.0500 1.2360 1.2777 4.9432 8.0436 7.7668 6.6469 6.9900 7.0366 1.0327 1.0327 1.1045 1.1045 1.0887 1.0897 1.0999 1.0999 1.0879 1.0879 1.0926 1.0926 1.0965 1.0964
irintensity: 1.0374 0.5310 5.3024 0.0000 0.0001 1.0158 0.0000 3.5486 0.0005 0.0000 11.7786 2.1430 0.0000 4.0773 0.0000 6.6274 0.0012 0.0002 19.8201 2.7973 0.0001 0.0000 4.6427 0.0041 0.0001 5.4063 0.0000 24.4493 0.0000 41.5988 8.9849 0.0000 0.0000 0.0000 54.3646 0.0000 10.7978 2.3731 0.0000 0.0001 29.1090 105.7401 0.1699 76.1679 0.0001 8.6247 0.0016 2.3975 0.0001 0.0060 87.4405 0.2046 49.4778 0.0006 6.2476 0.0008 0.0877 0.1083 153.3742 0.0004 8.6985 0.0236 45.2051 0.0006 468.3713 0.0030 0.0053 103.1513 40.4835 0.0000 107.9055 0.0006 101.6509 0.0001 40.6240 0.0019 357.6417 0.0002 8.5543 21.0533 8.0526 0.0046 0.0001 0.5800 0.0001 96.8313 0.0037 124.8163 173.7841 0.5222 7.4039 76.7062 20.1131 0.0019 1.5306 29.6360 8.4517 0.4247 1.4118 1.1536 21.9419 2.9716
temp: 298.150 k
press: 1.00000 atm
elementType: 35 35 8 8 7 7 6 6 6 6 6 6 6 6 6 6 6 6 6 6 6 6 1 1 1 1 1 1 1 1 1 1 1 1 1 1
symmnumber: 1
zpe: 688800.9 jmol-1
zpe.correction: 0.262350 hartree
zpe.thermalcorrener: 0.284288 hartree
zpe.thermalcorrenthalpy: 0.285232 hartree
zpe.thermalcorrgfe: 0.206924 hartree
zpe.sumelectzpe: -903.328466 hartree
zpe.sumelectthermal: -903.306529 hartree
zpe.sumelectthermalent: -903.305585 hartree
zpe.sumelectthermalfe: -903.383893 hartree
dipole: 0.0016 -0.0007 0.0072
dipole: 0.0074
quadrupole: -129.4852 -108.4306 -152.4637
quadrupole: 45.8074 0.0225 0.0274
quadrupole: 0.6413 21.6959 -22.3372 45.8074 0.0225 0.0274
hfenergy: -903.5908169 hartree
pointgroup: C01 [X(C16H14Br2N2O2)]
dipole: 0.0004701 0.0007252 -0.0027749 debye
polarizability: 504.9560015|12.646276|309.8760489|-13.1436626|25.1639435|94.5277191 unknown
InChI: InChI=1S/C16H14Br2N2O2/c1-21-15-5-3-13(17)7-11(15)9-19-20-10-12-8-14(18)4-6-16(12)22-2/h3-10H,1-2H3
charge 0 multiplicity 1
36 atoms
Br -5.349237 -3.238053 -0.188709
Br 5.345836 3.237616 0.192177
O  -3.522298 2.628604 0.429872
O  3.521891 -2.629577 -0.430692
N  -0.659455 -0.279644 -0.006369
N  0.657865 0.276845 0.012418
C  -3.004473 0.303746 0.141417
C  3.002846 -0.305277 -0.13944
C  -4.000932 1.32159 0.294796
C  3.999774 -1.32233 -0.295087
C  -3.423997 -1.047882 -0.000861
C  3.421725 1.046459 0.003846
C  -5.375639 0.981567 0.304136
C  5.374262 -0.981403 -0.305465
C  -4.789278 -1.364719 0.010795
C  4.786769 1.364179 -0.008881
C  -5.774326 -0.365234 0.162044
C  5.772272 0.365477 -0.162312
C  -1.583035 0.656022 0.132978
C  1.581591 -0.658253 -0.12978
C  -4.498991 3.710155 0.592709
C  4.499088 -3.710597 -0.594225
H  -2.650685 -1.812178 -0.116873
H  2.648083 1.810133 0.121781
H  -6.145055 1.749367 0.420272
H  6.14406 -1.748591 -0.423117
H  -6.836382 -0.626556 0.169596
H  6.834155 0.627475 -0.170606
H  -1.307624 1.715207 0.245449
H  1.306429 -1.717292 -0.244145
H  -5.167647 3.780848 -0.286439
H  -3.896675 4.626053 0.676202
H  -5.0991 3.572229 1.512415
H  5.168415 -3.78093 0.284439
H  5.098483 -3.572282 -1.514334
H  3.897286 -4.626872 -0.677303
