program: Gaussian 09
title: 000291829
version: EM64L-G09RevD.01
frameworkgroup: C1[X(C22H15N3O6)]
method: RPBEPBE
basis: SDD
operation: Freq
keyword: #p
keyword: freq=noraman
keyword: PBEPBE/SDD
title: #p freq=noraman PBEPBE/SDD
converged: YES YES NO NO
title: Mulliken charges:
elementType: O O O O O O N N N C C C C C C C C C C C C C C C C C C C C C C H H H H H H H H H H H H H H H
charge: -0.162840 -0.162835 -0.182725 -0.182720 -0.204538 -0.204556 -0.031586 0.014801 0.014822 0.216310 0.216272 0.183101 0.277473 0.277453 -0.659287 -0.302613 -0.302617 -0.290387 -0.290394 0.481765 0.481764 -0.375364 -0.392858 -0.375365 -0.392856 -0.236405 -0.235028 -0.236400 -0.235026 -0.230272 -0.230272 0.327981 0.278189 0.278154 0.248914 0.248942 0.238659 0.240252 0.238660 0.240246 0.234864 0.235092 0.234862 0.235092 0.236638 0.236637
chargesum: 0.00000
title: Mulliken charges with hydrogens summed into heavy atoms:
elementType: O O O O O O N N N C C C C C C C C C C C C C C C C C C C C C C
charge: -0.162840 -0.162835 -0.182725 -0.182720 -0.204538 -0.204556 -0.031586 0.014801 0.014822 0.216310 0.216272 0.183101 0.277473 0.277453 -0.331306 -0.024424 -0.024463 -0.041473 -0.041452 0.481765 0.481764 -0.136706 -0.152606 -0.136705 -0.152609 -0.001541 0.000065 -0.001538 0.000066 0.006366 0.006365
polarizability: 6.37973563e+02 3.98301731e-02 4.29668691e+02 2.21953465e+01 7.54808375e-04 1.70977801e+02
1716.lowfreq: -7.2961 -5.6271 -0.2773 -0.0004 0.0003 0.0006 19.2504 19.8266 22.9969
frequency: 19.2251 19.6046 22.9453 26.9043 31.7525 38.9275 53.9010 55.7144 77.4723 79.7544 84.3755 90.1306 108.5982 140.2177 144.1300 162.6639 179.3125 180.7360 205.7497 249.5770 253.2799 267.2072 281.0866 306.4831 318.6283 342.7973 371.4332 392.0277 399.6660 400.0592 409.3792 452.6918 471.8252 476.4309 492.7316 520.5678 536.8019 574.7302 576.6151 613.0326 613.4439 628.5535 636.4884 658.6117 662.8401 679.7056 690.6508 691.2404 721.8007 727.2193 738.5100 745.7350 758.2808 774.0013 775.9707 826.0203 836.9087 847.5890 848.1705 880.0576 884.8566 886.2037 886.4738 930.6900 930.8807 950.9637 982.7226 982.7944 988.1588 988.2517 992.1864 993.7157 1005.8771 1006.4046 1025.1764 1025.6192 1054.6149 1087.5771 1090.2843 1128.6377 1173.4701 1176.2288 1176.2723 1187.0674 1194.2930 1195.3585 1198.6874 1201.6518 1236.1885 1240.4393 1249.0773 1296.2382 1302.5184 1306.6230 1311.5669 1343.5647 1346.4464 1352.1028 1368.6882 1372.4271 1380.9710 1392.2409 1393.0763 1400.7176 1425.2486 1442.1942 1444.2039 1485.5963 1486.7696 1528.6396 1571.1242 1579.4374 1580.5049 1607.4553 1609.4350 1624.7169 1625.4332 3116.7894 3117.0198 3126.3328 3126.3563 3133.6553 3133.6762 3144.4565 3144.4819 3155.8359 3155.8567 3170.2715 3170.3736 3180.4607 3180.5709 3190.4418
redmass: 6.4485 8.9312 5.5778 3.8719 5.2135 9.4465 14.8683 9.0501 6.6880 8.2209 4.3619 5.4695 5.2947 6.3799 5.5072 8.4298 11.1021 7.7060 8.1391 3.2248 2.6908 4.5797 6.9347 11.2984 8.2249 7.5310 8.5648 9.1760 2.7971 2.7593 4.7623 4.9481 5.6207 3.7825 3.3947 6.3458 6.4311 7.3295 6.6698 6.5430 6.4613 8.2679 8.0067 8.5093 6.6182 11.4367 1.8256 1.7588 9.2589 4.9657 10.2980 4.3574 4.6127 2.0851 2.1167 6.0401 4.5509 1.2978 1.3337 3.3601 1.9046 2.5406 7.3372 1.4310 1.4325 1.4948 1.4172 1.4134 5.1930 5.3974 1.2645 1.2471 1.3172 1.3007 2.2303 2.2124 4.0530 1.6338 1.6419 11.1505 1.8053 1.0642 1.0633 11.1389 1.3970 1.1388 4.4340 4.1472 2.5251 1.9158 3.7483 1.6807 1.8591 1.5178 1.9154 1.3436 3.7906 1.7516 4.9655 6.9403 11.5577 6.0357 5.2428 4.3097 3.7918 2.2984 2.4121 2.2744 2.3214 9.5820 7.2643 5.4515 5.7296 5.6644 5.9349 5.2400 5.1907 1.0913 1.0913 1.0874 1.0874 1.0867 1.0867 1.0915 1.0915 1.0965 1.0965 1.1016 1.1016 1.0867 1.0867 1.0918
irintensity: 0.1384 0.7462 0.1958 0.4981 0.2829 0.2766 0.5271 0.4974 1.9824 3.1782 18.9685 0.0051 5.8422 0.1641 12.5823 0.0540 2.6688 1.7856 5.9149 4.0724 8.4432 8.8638 0.9660 1.0760 0.5922 5.8007 4.6000 0.1184 0.0777 0.4062 7.2653 0.0126 8.5488 22.5222 9.0180 3.4146 5.3914 22.4206 2.7563 0.0172 0.1009 1.8723 2.5216 21.1990 24.9085 17.4344 69.6340 18.7258 0.1185 6.6479 0.5581 9.0518 17.6103 16.2215 90.5457 0.6272 1.4446 0.1659 0.0327 50.2738 5.8684 5.9056 10.5538 5.5961 1.0302 34.9744 22.4409 1.4462 9.0871 3.4975 122.1625 0.3796 40.5443 0.1686 5.6613 1.1803 18.3027 6.3607 8.6959 0.3537 3.8723 0.2913 2.0369 458.5822 151.7042 30.9516 141.0270 458.6911 4.5965 62.1421 0.0239 4.8144 42.2215 11.8502 1.3446 68.5092 54.6854 0.5671 78.3191 93.8478 112.6691 20.7413 6.1638 25.9113 126.7260 0.1263 141.4349 1.0758 15.4368 107.5420 898.5945 26.7409 67.8357 74.8391 19.8998 181.7901 224.4712 4.2266 0.0102 7.5518 0.4965 1.2138 0.7292 9.1913 2.7007 25.5394 28.4697 69.1289 17.3458 16.1644 11.0867 22.2572
temp: 298.150 k
press: 1.00000 atm
elementType: 8 8 8 8 8 8 7 7 7 6 6 6 6 6 6 6 6 6 6 6 6 6 6 6 6 6 6 6 6 6 6 1 1 1 1 1 1 1 1 1 1 1 1 1 1 1
symmnumber: 1
zpe: 855606.9 jmol-1
zpe.correction: 0.325883 hartree
zpe.thermalcorrener: 0.352844 hartree
zpe.thermalcorrenthalpy: 0.353789 hartree
zpe.thermalcorrgfe: 0.263557 hartree
zpe.sumelectzpe: -1460.500135 hartree
zpe.sumelectthermal: -1460.473174 hartree
zpe.sumelectthermalent: -1460.472230 hartree
zpe.sumelectthermalfe: -1460.562462 hartree
dipole: -0.0005 -6.1610 -0.0007
dipole: 6.1610
quadrupole: -147.7174 -195.6718 -178.1375
quadrupole: -0.0021 -1.3846 0.0072
quadrupole: 26.1248 -21.8296 -4.2952 -0.0021 -1.3846 0.0072
hfenergy: -1460.8260189 hartree
pointgroup: C01 [X(C22H15N3O6)]
dipole: -0.001583 2.4239235 0.0016555 debye
polarizability: 631.9652046|0.1084092|429.6686642|-57.1173773|0.1133126|176.9861866 unknown
InChI: InChI=1S/C22H15N3O6/c26-23(27)20-15-21(24(28)29)19(14-12-17-9-5-2-6-10-17)22(25(30)31)18(20)13-11-16-7-3-1-4-8-16/h1-15H
charge 0 multiplicity 1
46 atoms
O  0.011716 1.584643 -1.140701
O  -0.015794 1.584007 1.140542
O  2.357207 -4.6299 -0.109907
O  -2.352704 -4.633121 0.105353
O  3.294999 -2.976717 -1.36204
O  -3.292569 -2.981948 1.358642
N  -0.001607 0.989118 -0.00024
N  2.351888 -3.438059 -0.607317
N  -2.348981 -3.441568 0.603465
C  -1.243426 -1.146286 0.287434
C  1.24338 -1.14437 -0.289259
C  -0.000468 -0.505617 -0.000661
C  1.176917 -2.580798 -0.312735
C  -1.175071 -2.582619 0.309593
C  0.001376 -3.278523 -0.001876
C  -2.501188 -0.417392 0.512393
C  2.500209 -0.41356 -0.513399
C  -2.929803 0.683821 -0.189756
C  2.927595 0.687109 0.190351
C  -4.203042 1.384978 0.016092
C  4.200035 1.390012 -0.014445
C  -5.191775 0.959363 0.953163
C  -4.463706 2.550816 -0.762945
C  5.189425 0.966686 -0.951859
C  4.459245 2.555151 0.766123
C  -6.389568 1.681184 1.105863
C  -5.663026 3.274361 -0.606897
C  6.386445 1.690039 -1.103397
C  5.657784 3.280239 0.611228
C  -6.63137 2.841971 0.328827
C  6.626799 2.85011 -0.324843
H  0.002097 -4.370927 -0.002381
H  -3.15577 -0.866694 1.261056
H  3.155247 -0.861001 -1.262768
H  -2.31214 1.08513 -1.004093
H  2.309551 1.08646 1.005357
H  -5.030349 0.058929 1.555251
H  -3.712178 2.888202 -1.487247
H  5.029126 0.066804 -1.555065
H  3.70721 2.890778 1.490714
H  -7.141452 1.341176 1.826115
H  -5.844132 4.169474 -1.211275
H  7.138861 1.351772 -1.823914
H  5.837768 4.174786 1.216776
H  -7.566634 3.39913 0.450701
H  7.561474 3.408453 -0.445817
