program: Gaussian 09
title: 000291759
version: EM64L-G09RevD.01
frameworkgroup: C1[X(C14H19NO6)]
method: RPBEPBE
basis: SDD
operation: Freq
keyword: #p
keyword: freq=noraman
keyword: PBEPBE/SDD
title: #p freq=noraman PBEPBE/SDD
converged: YES YES NO NO
title: Mulliken charges:
elementType: O O O O O O N C C C C C C C C C C C C C C H H H H H H H H H H H H H H H H H H H
charge: -0.307149 -0.263655 -0.459955 -0.244902 -0.247196 -0.246011 -0.412745 0.283158 -0.536885 0.113276 0.073173 0.093918 -0.538365 -0.825251 0.168884 0.091959 0.259042 -0.253652 -0.263840 -0.661496 -0.662025 0.248546 0.238769 0.286775 0.252709 0.368168 0.239568 0.231820 0.280793 0.223922 0.237335 0.232085 0.221328 0.388805 0.219135 0.250991 0.225893 0.250370 0.228208 0.214499
chargesum: 0.00000
title: Mulliken charges with hydrogens summed into heavy atoms:
elementType: O O O O O O N C C C C C C C C C C C C C C
charge: -0.307149 -0.263655 -0.071151 -0.244902 -0.247196 -0.246011 -0.044578 0.283158 -0.049570 0.113276 0.073173 0.093918 0.001119 -0.073070 0.168884 0.091959 0.259042 0.207606 0.189573 0.034522 0.031052
polarizability: 2.70694790e+02 -1.71775870e+01 1.91783117e+02 1.18878473e+01 5.58300998e+00 1.19921743e+02
1716.lowfreq: -3.9591 -1.7772 -0.0011 -0.0008 0.0008 5.5576 16.9901 21.0451 31.5580
frequency: 16.6058 21.0144 31.5464 48.1417 57.8302 60.9877 73.6546 79.1287 86.0922 89.7534 103.1014 113.3094 114.9420 134.9728 153.8664 186.3309 215.3914 216.9580 253.2630 262.8637 291.4485 309.3233 318.3043 323.1057 342.7313 387.2426 406.8101 435.1058 457.1525 474.6594 542.7291 557.6750 586.2836 610.8683 619.7096 641.2713 666.5649 697.4540 718.7765 727.3917 741.5396 756.6139 761.6676 784.6625 807.7168 817.8811 822.5170 840.4693 902.6168 950.8148 985.5366 998.9705 1008.8232 1035.4105 1041.6712 1055.8992 1076.9330 1095.4675 1096.1463 1130.5209 1151.7611 1157.2673 1159.7935 1172.8462 1209.4112 1223.2551 1275.7331 1277.1852 1279.4884 1282.6442 1292.3387 1346.3196 1352.7184 1359.5026 1366.0361 1390.7374 1392.6989 1404.1638 1438.8117 1446.1417 1452.1599 1458.7550 1460.1942 1463.4226 1463.6438 1468.2240 1474.9166 1484.4790 1485.1161 1485.7015 1510.3886 1553.7780 1626.6808 1639.6191 1656.8665 2979.9391 2992.3495 2993.2076 3001.3982 3018.5240 3028.0154 3030.1584 3051.5983 3056.8458 3082.4616 3087.2679 3088.3564 3091.7587 3093.0098 3111.3686 3117.9654 3118.6703 3546.6207 3594.2640
redmass: 4.8116 4.6907 4.5385 3.1260 3.0878 5.5637 3.6386 1.8004 3.2779 2.5612 3.9273 3.3389 2.7120 3.9955 3.8745 3.4109 1.3042 1.4384 2.4500 3.7251 3.4042 3.7538 3.3303 3.7616 8.5543 4.0466 4.7171 4.5549 3.8859 4.4060 1.3367 2.6985 3.4744 4.5065 4.6728 4.8595 5.5031 4.2515 1.1124 4.3420 8.6282 4.9513 2.3274 1.8458 1.4802 1.4822 2.7404 3.2203 3.7037 3.2469 2.6435 2.1055 2.8339 3.8885 1.6485 3.6148 2.1577 2.1753 2.1547 3.1041 1.5791 1.6677 1.6631 1.6313 2.5038 2.6743 1.5527 1.2579 1.2611 1.1909 1.4779 2.2229 1.4270 1.5246 1.7401 1.2331 1.2318 1.2208 1.1626 1.6356 2.8263 1.0912 1.3061 1.0459 1.0615 1.2841 1.6202 1.0594 1.0518 1.0558 10.2499 5.4717 9.1318 8.7404 8.7109 1.0392 1.0362 1.0361 1.0620 1.0600 1.0593 1.0593 1.0971 1.0977 1.1022 1.0973 1.0976 1.1034 1.1034 1.0975 1.1057 1.1060 1.0646 1.0813
irintensity: 0.7661 0.1201 0.7412 0.0302 0.2206 0.2615 0.5831 2.3141 0.1317 0.8782 0.9306 0.8370 4.1046 1.4454 1.1007 4.1465 2.6116 4.1495 0.5957 1.4768 5.3563 1.7268 5.5055 25.2598 10.2984 7.2689 14.3341 8.4228 5.2053 4.6467 92.6634 4.8601 25.8995 26.7255 45.7204 6.1417 7.4569 1.2893 107.6977 5.0548 1.1817 8.1573 14.2217 2.2064 1.7946 3.1041 6.4904 13.4072 8.0718 173.5856 34.4938 106.3571 39.6287 410.5310 46.0440 90.9095 115.9434 47.2993 14.3360 313.3013 63.7855 17.5312 56.5721 48.7573 139.5448 27.3826 112.2992 9.6454 18.1197 12.5926 102.0477 89.2657 21.9897 30.5036 10.6948 23.1400 25.2421 29.2828 8.0022 81.8144 3.7354 12.5601 70.8012 13.6213 13.8851 12.5324 36.4515 13.3509 13.0643 15.6930 114.0412 0.5589 588.5364 156.1747 151.6880 23.5917 21.5850 21.1162 10.6040 12.7973 33.6164 35.1495 16.0118 3.0844 9.1212 39.8173 38.6798 0.5349 1.5270 1.0378 33.8124 29.1501 59.4619 140.7225
temp: 298.150 k
press: 1.00000 atm
elementType: 8 8 8 8 8 8 7 6 6 6 6 6 6 6 6 6 6 6 6 6 6 1 1 1 1 1 1 1 1 1 1 1 1 1 1 1 1 1 1 1
symmnumber: 1
zpe: 830763.5 jmol-1
zpe.correction: 0.316421 hartree
zpe.thermalcorrener: 0.339741 hartree
zpe.thermalcorrenthalpy: 0.340685 hartree
zpe.thermalcorrgfe: 0.259996 hartree
zpe.sumelectzpe: -1049.432626 hartree
zpe.sumelectthermal: -1049.409306 hartree
zpe.sumelectthermalent: -1049.408362 hartree
zpe.sumelectthermalfe: -1049.489051 hartree
dipole: 2.1166 2.0736 1.9114
dipole: 3.5261
quadrupole: -98.6867 -120.0085 -126.4664
quadrupole: 10.2884 -5.5292 -0.3515
quadrupole: 16.3672 -4.9547 -11.4125 10.2884 -5.5292 -0.3515
hfenergy: -1049.7490474 hartree
pointgroup: C01 [X(C14H19N1O6)]
dipole: 0.8411577 -0.3604899 -1.0425906 debye
polarizability: 270.9391333|19.9140754|170.3945525|-0.7566731|33.4407598|141.0659639 unknown
InChI: InChI=1S/C14H19NO6/c1-4-20-10(16)7-6-9-8(3)11(14(19)21-5-2)15-12(9)13(17)18/h15,17H,4-7H2,1-3H3
charge 0 multiplicity 1
40 atoms
O  4.359455 0.189292 -0.842494
O  -4.710013 1.048105 -0.993501
O  0.866255 -2.963637 -1.9239
O  3.893574 2.00427 0.573929
O  -1.30146 -2.564454 -1.145458
O  -4.269913 0.627817 1.260866
N  1.855578 -0.740724 -0.749659
C  -0.070991 -0.059397 0.262825
C  -1.509858 0.008529 0.710397
C  0.970033 0.863335 0.607312
C  0.510785 -1.045132 -0.583825
C  2.156166 0.413256 -0.038881
C  -2.454877 0.483365 -0.421456
C  0.834295 2.07221 1.496244
C  3.509189 0.974046 -0.036015
C  -0.094982 -2.213719 -1.203228
C  -3.87354 0.709045 0.074596
C  5.787437 0.622238 -0.917416
C  -6.15001 1.290473 -0.665675
C  6.599398 0.017391 0.231245
C  -6.935809 -0.023881 -0.675003
H  -1.853326 -0.984903 1.049691
H  -1.604268 0.692165 1.571752
H  -2.482982 -0.263499 -1.235264
H  -2.093074 1.427258 -0.872646
H  2.522782 -1.27823 -1.303791
H  0.539894 1.779791 2.521965
H  0.053362 2.759864 1.121429
H  1.785512 2.622936 1.555123
H  6.120437 0.253915 -1.901066
H  5.818336 1.725596 -0.892969
H  -6.208535 1.785723 0.3197
H  -6.483994 1.978188 -1.459143
H  0.417601 -3.749455 -2.33402
H  7.666527 0.281959 0.11166
H  6.255348 0.409605 1.202826
H  6.515643 -1.083115 0.238758
H  -6.59322 -0.691094 0.133599
H  -6.819712 -0.54455 -1.641193
H  -8.011245 0.182621 -0.519411
