program: Gaussian 09
title: 000291755
version: EM64L-G09RevD.01
frameworkgroup: C1[X(C13H19NO4)]
method: RPBEPBE
basis: SDD
operation: Freq
keyword: #p
keyword: freq=noraman
keyword: PBEPBE/SDD
title: #p freq=noraman PBEPBE/SDD
converged: YES YES NO NO
title: Mulliken charges:
elementType: O O O O N C C C C C C C C C C C C C H H H H H H H H H H H H H H H H H H H
charge: -0.322545 -0.265704 -0.268626 -0.249217 -0.425876 0.387648 -0.537230 0.010060 -0.564961 0.366962 -0.536058 -0.805591 0.169138 0.259575 -0.255414 -0.263982 -0.663068 -0.663146 0.228179 0.244236 0.264599 0.294045 0.251057 0.335745 0.238410 0.236144 0.251421 0.236959 0.218580 0.219265 0.231129 0.215518 0.251174 0.220749 0.250928 0.227238 0.212656
chargesum: 0.00000
title: Mulliken charges with hydrogens summed into heavy atoms:
elementType: O O O O N C C C C C C C C C C C C C
charge: -0.322545 -0.265704 -0.268626 -0.249217 -0.090131 0.387648 -0.064816 0.010060 -0.300362 0.366962 0.009044 -0.079615 0.169138 0.259575 0.200125 0.186412 0.024373 0.027677
polarizability: 1.96885138e+02 -1.14754448e+01 1.95121705e+02 9.34805617e+00 -2.57093500e+00 1.13517750e+02
1716.lowfreq: -5.2538 -3.0934 0.0008 0.0009 0.0010 3.6246 15.6234 23.3177 36.9193
frequency: 15.5959 23.2562 36.9067 50.5422 57.6450 68.1121 70.4331 81.9138 97.9716 108.8902 120.3774 152.1898 162.6324 205.1244 215.6782 222.1031 228.0137 290.9884 305.1400 322.9232 333.4673 390.3469 400.7312 435.1835 457.1168 513.0064 556.3544 594.7271 619.1221 631.5715 664.6664 683.3592 702.8224 735.8920 763.6922 774.8599 803.6000 812.8701 822.8642 829.8619 837.3735 902.8763 977.4044 988.7713 999.5554 1005.6476 1010.9470 1036.1934 1043.2439 1056.5832 1094.8503 1095.6165 1126.4264 1146.6616 1152.8172 1156.5013 1165.2050 1209.2249 1244.0889 1273.7364 1278.5168 1281.4348 1283.9940 1332.4021 1350.7487 1359.5134 1365.3543 1389.7345 1390.3957 1403.7495 1409.4708 1438.6385 1445.0988 1457.6375 1458.4785 1461.4683 1462.7279 1465.3303 1469.8180 1483.1206 1484.0500 1484.8213 1508.3826 1571.6406 1632.5018 1639.8702 2973.6064 2990.8085 2991.3439 3000.6201 3013.1099 3025.7875 3026.8919 3045.4291 3051.0732 3076.7005 3084.6327 3086.4845 3089.7334 3090.0544 3101.2649 3115.0550 3116.2049 3210.1812 3589.6397
redmass: 4.6185 3.9351 3.2588 3.7528 2.9280 2.1372 1.3873 3.1493 5.2070 2.9259 2.7521 3.6207 3.3996 1.6951 1.3868 2.0518 2.7941 3.1812 2.9456 3.4140 3.7839 4.5934 3.7397 3.7947 4.1140 3.4063 2.7136 4.4140 5.6022 2.9208 2.0865 1.9243 4.2604 5.8475 2.6411 1.5370 1.3775 1.3738 2.0851 1.7904 3.0299 3.6434 2.0222 1.9521 4.0445 2.0159 2.7120 5.2792 1.4761 4.7596 2.1470 2.1724 2.8390 1.4571 1.6339 1.6604 1.7263 2.2875 1.5144 1.3831 1.1309 1.1166 1.3144 2.4094 1.3355 1.4049 1.6599 1.2333 1.2357 1.7697 1.9480 1.1619 2.2754 1.0877 1.1554 1.0471 1.0490 1.2474 1.0445 1.2502 1.1002 1.0518 6.0726 5.1313 9.6350 8.7166 1.0391 1.0361 1.0361 1.0605 1.0598 1.0593 1.0589 1.0981 1.0991 1.1026 1.0987 1.0974 1.1026 1.1035 1.0962 1.1055 1.1055 1.0981 1.0808
irintensity: 0.9715 0.2513 0.8139 3.0765 0.4377 0.9200 0.4044 1.1593 0.2434 2.6724 2.8996 0.1712 0.0887 0.6373 5.0448 3.8807 4.0339 4.0579 18.7856 14.3383 5.1441 0.4356 8.1033 3.0697 0.3840 7.8481 1.7094 7.1382 2.9688 0.5262 31.0905 56.0963 10.8125 6.8119 8.7813 15.8964 13.8367 5.2428 12.7770 38.5177 4.5664 12.2143 57.2378 50.3384 4.8280 15.9573 29.7966 324.7523 7.3102 105.0724 31.0804 34.9832 266.5008 17.6148 36.2128 12.2570 5.1447 59.4652 160.2212 23.6250 0.8715 3.8650 77.5360 113.9665 2.9286 16.6912 8.7957 22.6512 26.0205 4.1508 6.7382 9.8664 36.3142 15.5077 19.7856 13.2823 16.3847 22.6848 15.8715 2.7744 8.5248 13.4651 119.9580 106.2677 327.4567 154.9118 47.9265 22.4384 22.0563 18.1451 15.8287 37.9643 38.0904 19.6049 6.0212 13.1768 34.5681 40.2629 8.0346 0.9169 11.9410 34.4698 34.8101 4.1018 80.2186
temp: 298.150 k
press: 1.00000 atm
elementType: 8 8 8 8 7 6 6 6 6 6 6 6 6 6 6 6 6 6 1 1 1 1 1 1 1 1 1 1 1 1 1 1 1 1 1 1 1
symmnumber: 1
zpe: 794761.8 jmol-1
zpe.correction: 0.302709 hartree
zpe.thermalcorrener: 0.323106 hartree
zpe.thermalcorrenthalpy: 0.324051 hartree
zpe.thermalcorrgfe: 0.249938 hartree
zpe.sumelectzpe: -861.075123 hartree
zpe.sumelectthermal: -861.054726 hartree
zpe.sumelectthermalent: -861.053782 hartree
zpe.sumelectthermalfe: -861.127894 hartree
dipole: 3.6269 0.1448 2.4808
dipole: 4.3966
quadrupole: -82.7439 -95.5277 -112.2335
quadrupole: -4.1382 -3.3090 -2.9106
quadrupole: 14.0911 1.3074 -15.3985 -4.1382 -3.3090 -2.9106
hfenergy: -861.3778323 hartree
pointgroup: C01 [X(C13H19N1O4)]
dipole: -1.4644279 0.3319813 0.8586296 debye
polarizability: 194.1364373|-12.1700081|196.4963272|-2.6655992|-13.4825093|114.8918287 unknown
InChI: InChI=1S/C13H19NO4/c1-4-17-11(15)7-6-10-8-9(3)14-12(10)13(16)18-5-2/h8,14H,4-7H2,1-3H3
charge 0 multiplicity 1
37 atoms
O  -3.012791 -1.375899 -0.044389
O  3.679131 -0.213714 1.295913
O  -0.709585 -1.715863 -0.397286
O  3.682632 0.422341 -0.950599
N  -2.804465 1.300824 -0.157444
C  -0.572473 1.408952 -0.612488
C  0.866292 1.041207 -0.885825
C  -1.648536 0.52329 -0.343735
C  -1.12138 2.730198 -0.577335
C  -2.50313 2.645032 -0.294911
C  1.584587 0.48812 0.36881
C  -3.540212 3.722611 -0.154184
C  -1.684806 -0.925363 -0.273667
C  3.062583 0.244603 0.124209
C  -3.188904 -2.850039 0.085773
C  5.136636 -0.533434 1.20186
C  -2.967068 -3.301478 1.532819
C  5.34606 -1.96952 0.712519
H  1.411254 1.926039 -1.259347
H  0.923378 0.272705 -1.677909
H  -0.570718 3.655023 -0.745839
H  1.120197 -0.468461 0.672477
H  1.48033 1.177742 1.227541
H  -3.715046 0.885867 0.039545
H  -4.334923 3.634265 -0.919738
H  -4.029013 3.699778 0.838625
H  -3.073029 4.713345 -0.272638
H  -2.480619 -3.348242 -0.599215
H  -4.225095 -3.024265 -0.247775
H  5.50112 -0.390254 2.231986
H  5.614653 0.194427 0.52245
H  -3.172567 -4.384584 1.623303
H  -1.922951 -3.122789 1.839782
H  -3.639942 -2.763685 2.223339
H  4.985052 -2.086324 -0.32305
H  4.811969 -2.686705 1.359471
H  6.42348 -2.219247 0.733053
