program: Gaussian 09
title: 000291750
version: EM64L-G09RevD.01
frameworkgroup: C1[X(C15H21ClO)]
method: RPBEPBE
basis: SDD
operation: Freq
keyword: #p
keyword: freq=noraman
keyword: PBEPBE/SDD
title: #p freq=noraman PBEPBE/SDD
converged: YES YES NO NO
title: Mulliken charges:
elementType: Cl O C C C C C C C C C C C C C C C H H H H H H H H H H H H H H H H H H H H H
charge: -0.060293 -0.447459 -0.375994 -0.361484 -0.439631 -0.354710 -0.155523 -0.355352 -0.144396 -0.695246 -0.355189 0.521324 -0.387032 -0.398303 -0.217324 -0.225312 -0.109644 0.185816 0.219063 0.186559 0.192686 0.187322 0.218647 0.187580 0.191350 0.191009 0.194269 0.195893 0.243957 0.216115 0.210961 0.209549 0.223501 0.331489 0.232807 0.234520 0.253773 0.254703
chargesum: 0.00000
title: Mulliken charges with hydrogens summed into heavy atoms:
elementType: Cl O C C C C C C C C C C C C C C C
charge: -0.060293 -0.115970 0.028885 0.017761 -0.033662 0.024220 0.035485 0.034809 0.099561 -0.058620 -0.131688 0.521324 -0.154225 -0.163783 0.036449 0.029391 -0.109644
polarizability: 2.46295256e+02 -5.50520727e+01 1.66405420e+02 -3.65495038e+00 -1.03782021e+01 1.47673419e+02
1716.lowfreq: -13.9731 -1.4586 -0.0028 -0.0023 -0.0022 2.0479 14.5437 22.0995 36.5169
frequency: 12.0941 22.0450 36.3314 49.3825 54.4759 78.3873 82.8037 100.2966 119.2049 138.0001 166.0705 177.7424 229.9691 232.4850 234.7217 242.5795 273.5590 315.8996 336.5201 346.7997 402.8037 414.0262 415.8756 466.8568 489.5802 528.4005 538.9390 627.1822 657.8619 713.9796 722.2651 736.8882 784.8488 817.6781 821.8255 825.8985 865.8196 877.5479 890.1787 943.8789 950.0233 957.8460 964.9314 983.9138 997.6139 1000.9631 1019.6456 1031.1076 1051.3720 1071.4694 1075.1201 1077.6477 1106.4666 1115.3857 1130.7948 1187.4639 1190.9230 1201.0951 1221.8518 1231.8628 1237.5405 1266.1833 1272.8973 1283.9638 1286.8777 1292.8110 1297.9468 1304.6334 1312.6640 1328.1889 1349.9302 1352.8338 1367.9268 1390.0130 1394.4716 1407.4825 1456.5648 1463.7608 1465.6759 1474.3688 1477.3928 1480.3930 1482.9058 1488.9967 1577.5533 1599.4187 1671.3123 2938.7650 2945.6718 2951.1329 2954.2347 2961.8860 2967.9865 2971.9901 2987.3750 3001.4932 3013.4005 3027.9952 3043.0903 3068.2932 3070.9791 3081.7644 3106.8899 3129.5631 3144.6654 3168.5846 3171.7847 3543.8932
redmass: 5.1394 3.5580 1.5913 4.7845 4.0025 3.9023 5.0694 2.0785 2.0641 2.1405 4.0315 3.5699 3.3287 1.2264 4.1085 3.0953 1.3684 3.1780 3.7927 4.0808 3.1095 3.1573 5.0808 3.1813 3.6135 2.8234 3.6781 7.0244 6.3852 3.2371 1.0674 1.1141 1.2183 1.7693 2.9289 1.3360 1.4018 1.9215 1.8775 2.7385 1.3404 2.0894 1.3802 1.1612 4.1032 2.2580 2.0560 2.6237 2.6326 2.5245 2.6301 2.2080 1.4271 2.2495 1.7074 1.1510 1.5834 1.2566 1.6293 1.5336 1.3669 1.2792 1.2411 1.1771 1.0847 1.2686 1.1869 1.2338 1.4016 1.3945 1.5659 1.6696 2.8237 1.2166 2.7233 2.2175 1.0904 1.0665 1.0770 1.0764 1.0423 2.3616 1.0950 1.0902 7.1608 6.1175 6.2564 1.0840 1.0635 1.0592 1.0594 1.0621 1.0597 1.0364 1.0963 1.0977 1.0982 1.1033 1.1036 1.1007 1.0992 1.0907 1.0889 1.0897 1.0882 1.0955 1.0967 1.0658
irintensity: 0.0318 0.0423 0.0086 0.3172 0.4694 0.2275 0.5350 0.8933 0.2586 0.3097 3.3037 0.6136 0.4442 0.4204 7.4978 21.5478 117.4992 1.2882 10.3452 3.7570 5.5703 1.3870 22.7019 1.5006 5.3322 8.8037 21.4581 0.1163 9.3278 2.0542 13.4055 0.8783 10.1270 31.9400 24.2678 14.0269 2.9550 13.8345 4.7956 23.7552 5.6022 63.4459 0.2734 55.0779 34.6488 14.4480 3.5059 16.2109 3.7994 15.3710 32.9135 0.2184 7.9317 24.8589 34.5689 0.4766 0.9073 30.8867 5.3960 1.7131 4.7462 3.5704 2.9965 0.9279 1.6533 1.0813 3.6380 9.5000 1.7875 1.8093 2.0504 1.2553 4.3383 11.1299 15.7535 18.2956 2.2420 0.1417 0.4942 2.3254 12.2545 92.3946 2.7089 20.2997 0.6543 8.6079 1.4373 38.9937 41.9002 7.2505 4.2248 17.1982 128.8342 35.5096 3.4844 4.1875 8.2339 3.4280 132.7680 93.2900 55.2139 17.1565 20.2082 13.3613 6.1403 9.4053 0.7793 8.0395
temp: 298.150 k
press: 1.00000 atm
elementType: 17 8 6 6 6 6 6 6 6 6 6 6 6 6 6 6 6 1 1 1 1 1 1 1 1 1 1 1 1 1 1 1 1 1 1 1 1 1
symmnumber: 1
zpe: 839750.7 jmol-1
zpe.correction: 0.319844 hartree
zpe.thermalcorrener: 0.339179 hartree
zpe.thermalcorrenthalpy: 0.340123 hartree
zpe.thermalcorrgfe: 0.268077 hartree
zpe.sumelectzpe: -1118.155843 hartree
zpe.sumelectthermal: -1118.136508 hartree
zpe.sumelectthermalent: -1118.135564 hartree
zpe.sumelectthermalfe: -1118.207610 hartree
dipole: -3.7999 -0.0044 0.8306
dipole: 3.8896
quadrupole: -117.2174 -119.5708 -102.9520
quadrupole: -4.8059 -0.1397 -0.3137
quadrupole: -3.9707 -6.3240 10.2947 -4.8059 -0.1397 -0.3137
hfenergy: -1118.4756866 hartree
pointgroup: C01 [X(C15H21Cl1O1)]
dipole: 1.4795757 -0.1147109 0.3734343 debye
polarizability: 239.6825654|-59.8354068|170.8618249|2.0295705|10.0975868|149.8297046 unknown
InChI: InChI=1S/C15H21ClO/c1-2-3-4-5-6-15(17)12-9-13-7-10-14(16)11-8-13/h7-12,15,17H,2-6H2,1H3
charge 0 multiplicity 1
38 atoms
Cl -5.952563 2.306783 -0.476484
O  0.835496 -3.935403 -0.606866
C  2.6672 -0.610618 0.210013
C  3.987639 0.01811 -0.289588
C  2.325226 -1.939964 -0.496994
C  4.32881 1.350677 0.413961
C  1.018919 -2.602593 0.018097
C  5.64591 1.986916 -0.086527
C  -0.214352 -1.815847 -0.347349
C  5.978996 3.318796 0.619619
C  -0.985694 -1.140521 0.548972
C  -2.179063 -0.3204 0.259967
C  -2.706565 -0.14319 -1.051929
C  -2.844939 0.328827 1.337566
C  -3.848817 0.648705 -1.28034
C  -3.989818 1.126871 1.12854
C  -4.475557 1.276121 -0.183618
H  2.7373 -0.78144 1.305352
H  1.836634 0.107444 0.060711
H  4.82076 -0.700237 -0.137313
H  3.9212 0.188522 -1.384554
H  3.163033 -2.655977 -0.344773
H  2.236571 -1.780928 -1.590185
H  4.398367 1.181605 1.509151
H  3.496015 2.069111 0.263438
H  1.08702 -2.70888 1.124013
H  6.47795 1.268784 0.064441
H  5.575775 2.154702 -1.180806
H  -0.445499 -1.819135 -1.421777
H  6.923854 3.752231 0.24313
H  5.177504 4.064321 0.45835
H  6.08549 3.173197 1.711331
H  -0.705651 -1.199645 1.611919
H  1.685323 -4.440161 -0.522971
H  -2.22629 -0.630019 -1.907059
H  -2.461166 0.206823 2.357594
H  -4.247773 0.777493 -2.290759
H  -4.491745 1.619518 1.966124
