program: Gaussian 09
title: 000291717
version: EM64L-G09RevD.01
frameworkgroup: C1[X(C8H10N2O4)]
method: RPBEPBE
basis: SDD
operation: Freq
keyword: #p
keyword: freq=noraman
keyword: PBEPBE/SDD
title: #p freq=noraman PBEPBE/SDD
converged: YES YES NO NO
title: Mulliken charges:
elementType: O O O O N N C C C C C C C C H H H H H H H H H H
charge: -0.235773 -0.311721 -0.186646 -0.180827 -0.385538 -0.061840 0.350723 0.225066 -0.438174 -0.252656 -0.750941 0.092186 -0.656475 0.187114 0.306469 0.380163 0.242711 0.231076 0.241043 0.241030 0.252207 0.227334 0.230481 0.252988
chargesum: 0.00000
title: Mulliken charges with hydrogens summed into heavy atoms:
elementType: O O O O N N C C C C C C C C
charge: -0.235773 -0.311721 -0.186646 -0.180827 -0.005375 -0.061840 0.350723 0.225066 -0.131706 0.221131 -0.016661 0.092186 0.054328 0.187114
polarizability: 1.88730201e+02 -5.15130980e+00 1.15046196e+02 3.01178360e+00 3.83659713e+00 6.42667948e+01
1716.lowfreq: -14.8016 -1.0083 -0.0008 -0.0008 -0.0007 3.1978 31.1100 40.6471 66.0168
frequency: 30.2346 40.6302 65.9507 85.6898 92.3973 99.0728 126.4471 162.6851 208.2796 216.4737 282.1299 293.4927 344.3941 353.5853 361.9783 394.0427 467.1684 516.7348 606.3434 611.8374 663.0709 704.8512 741.6865 762.6801 764.2855 788.6901 816.0750 825.4817 845.9586 883.2008 959.9010 966.0140 1001.7392 1005.6811 1046.3606 1076.3992 1096.9969 1138.0497 1154.0250 1187.2687 1221.2398 1276.3403 1353.4876 1387.2472 1393.2932 1405.1491 1443.7093 1458.3590 1462.9626 1465.3854 1474.6567 1483.3996 1497.3334 1602.3538 1626.7921 1663.7312 2995.2123 2996.4847 3036.3896 3079.6270 3092.1306 3099.2768 3111.3618 3125.9211 3270.8256 3487.7755
redmass: 3.6073 3.8394 6.7747 3.7175 5.2263 4.0784 1.1598 3.1374 1.5810 2.7032 4.4733 2.7293 5.6252 12.5674 5.9711 4.1205 4.9228 7.7930 7.0000 5.1542 3.5869 4.6920 1.3369 4.9229 4.7556 3.5006 1.7881 4.2468 1.3193 6.3379 4.4101 2.2601 2.1852 2.7035 1.5018 6.2105 2.2198 2.0997 1.6886 2.2047 4.6015 1.1177 1.2613 2.1923 1.2251 1.5455 5.3689 1.0873 1.0460 1.0445 1.2943 1.0521 2.0736 7.5466 11.0884 10.4270 1.0368 1.0362 1.0599 1.0984 1.0974 1.1031 1.0993 1.1069 1.1000 1.0770
irintensity: 1.6333 2.3890 2.0957 4.2885 5.0214 2.8702 0.5101 3.7397 2.3582 5.9522 6.8913 5.9397 0.3350 3.0016 2.2672 3.1071 0.8307 12.5453 1.3318 2.3227 3.9058 35.7196 94.4823 12.4681 8.9066 0.6083 5.8117 2.8091 42.5014 41.4040 8.8074 12.0201 9.2450 65.0947 7.2275 293.8568 7.0210 29.8143 28.8041 47.6106 16.9434 2.2440 1.0231 2.5589 24.9532 9.7305 42.6911 16.6492 21.1236 17.3973 142.9065 12.8045 235.0932 119.0039 163.9355 217.1489 17.0533 13.8465 25.0851 13.1926 30.3904 1.7153 8.0162 22.0189 5.7908 103.8044
temp: 298.150 k
press: 1.00000 atm
elementType: 8 8 8 8 7 7 6 6 6 6 6 6 6 6 1 1 1 1 1 1 1 1 1 1
symmnumber: 1
zpe: 468328.6 jmol-1
zpe.correction: 0.178377 hartree
zpe.thermalcorrener: 0.192686 hartree
zpe.thermalcorrenthalpy: 0.193630 hartree
zpe.thermalcorrgfe: 0.135354 hartree
zpe.sumelectzpe: -720.163494 hartree
zpe.sumelectthermal: -720.149185 hartree
zpe.sumelectthermalent: -720.148241 hartree
zpe.sumelectthermalfe: -720.206517 hartree
dipole: -1.8918 -2.0225 -0.0526
dipole: 2.7698
quadrupole: -62.7267 -94.9179 -80.2270
quadrupole: 22.1405 2.3655 -0.2845
quadrupole: 16.5639 -15.6274 -0.9365 22.1405 2.3655 -0.2845
hfenergy: -720.3418709 hartree
pointgroup: C01 [X(C8H10N2O4)]
dipole: 0.7531176 0.6877552 -0.3838288 debye
dipolederiv: -0.5963633 -0.204225 0.1348606 -0.0605912 -0.2862675 0.1295726 0.0135198 0.1177627 -0.2290515 -1.2526029 -0.3830955 0.0961294 -0.5833614 -0.8314465 0.2837126 0.3735841 0.3876996 -0.5843182 -0.3053573 -0.2383897 0.1913992 0.3596405 -0.6418546 0.3142142 -0.3130419 0.2706972 -0.564967 -0.7799967 0.2479557 -0.2455616 -0.0226287 -0.5779778 0.2174619 -0.0245212 0.267205 -0.4798453 -1.2361397 0.1853482 -0.2635533 0.3303475 -0.5053135 0.2430273 -0.3667821 0.2282268 -0.4902932 -0.0954229 0.1751075 -0.1484633 0.1115381 -0.1527416 -0.0227939 -0.088492 -0.0180064 -0.1837832 0.9830848 0.0355109 0.0477389 0.0631119 0.3037462 -0.1219213 0.0111133 -0.1217561 0.2646174 0.7313461 0.052371 0.0165353 0.0036295 0.0731127 -0.0315196 0.0536127 -0.0291102 0.0634135 -0.602431 -0.0650918 0.0211751 -0.0922948 -0.1751818 -0.0578519 0.0505842 -0.056037 -0.182449 0.8370255 0.3139262 -0.0904915 0.229638 0.383635 0.0356321 -0.0614659 -0.0058029 0.3280227 -0.1116112 -0.043383 0.0217138 -0.0739182 0.0320609 0.0292758 0.0488979 0.0319147 0.0495444 0.5405689 0.057853 -0.0027681 -0.6576256 0.8473137 -0.5897408 0.5972891 -0.5269991 0.7422599 -0.111972 -0.0948013 0.0012705 -0.0696773 -0.0313151 -0.0843902 -0.0195317 -0.0577486 -0.0785217 1.3431924 -0.1017461 0.1877137 0.3802535 1.0221857 -0.5518484 -0.2309609 -0.6805874 0.7269539 0.1542152 0.0197971 -0.021164 0.0152211 0.133729 0.0752667 -0.0185621 0.0751338 0.1529434 0.3819508 0.0450505 -0.0208748 0.018471 0.26399 0.0539751 -0.0058652 0.0578086 0.2824235 -0.0395891 -0.0146435 0.0315471 0.0729196 -0.070752 -0.0485172 -0.0344387 0.0026407 0.0884683 0.0055879 -0.0459821 -0.0214159 -0.0554122 0.061252 0.066206 0.0266648 0.0433509 -0.1031508 0.0461186 -0.0070461 0.0143867 -0.0679145 -0.0857046 -0.0576024 -0.0069327 -0.0528405 0.1099107 0.0392375 -0.0195801 0.0197445 -0.0075082 0.1196175 -0.0218176 0.0834343 -0.021876 -0.0888353 0.0184214 0.0301253 -0.0352633 0.1027804 0.0498209 0.0740327 -0.0975935 0.0675539 0.0586465 -0.1410132 -0.0790782 0.0429696 -0.0921524 0.0762605 -0.0009336 0.0263594 -0.0171891 0.105652 0.051447 0.1361367 -0.008344 0.0915215 -0.0566554 -0.0238535 -0.0316149 -0.0027042 0.0787722 0.140303 -0.0021198 0.0307151 0.0040118 0.0484862 0.0904133 0.0147431 0.0406636 -0.066413 unknown
polarizability: 187.4086893|2.2010705|95.0220073|13.3773549|-24.8726239|85.6124956 unknown
InChI: InChI=1S/C8H10N2O4/c1-3-13-8(12)7(11)9-6-4-5(2)10-14-6/h4,9H,3H2,1-2H3
charge 0 multiplicity 1
24 atoms
O  -1.821699 1.150217 -1.452209
O  2.606692 0.487862 -0.555043
O  0.199182 -1.61449 1.094563
O  3.085837 -1.217283 0.980892
N  0.047898 0.151833 -0.44694
N  -3.301372 1.03164 -1.471943
C  -1.334795 0.175559 -0.577306
C  -3.566296 0.010237 -0.617544
C  -2.377554 -0.557643 -0.032587
C  4.067991 0.810205 -0.697006
C  -4.995446 -0.39521 -0.387302
C  0.740222 -0.736405 0.375859
C  4.511819 1.787342 0.392801
C  2.270006 -0.543657 0.329363
H  -2.298466 -1.375647 0.67551
H  0.60395 0.825594 -0.986635
H  4.629453 -0.138987 -0.648597
H  4.136256 1.244566 -1.706496
H  -5.15286 -1.451417 -0.669495
H  -5.265559 -0.288516 0.678419
H  -5.674006 0.233355 -0.986192
H  5.565953 2.072766 0.220555
H  3.900474 2.705705 0.376483
H  4.442119 1.32537 1.391548
