program: Gaussian 09
title: 000291740
version: EM64L-G09RevD.01
frameworkgroup: C1[X(C18H14O5)]
method: RPBEPBE
basis: SDD
operation: Freq
keyword: #pfreq=noraman
keyword: PBEPBE/SDD
title: #p freq=noraman PBEPBE/SDD
converged: YES YES NO NO
title: Mulliken charges:
elementType: O O O O O C C C C C C C C C C C C C C C C C C H H H H H H H H H H H H H H
charge: -0.265205 -0.204548 -0.234383 -0.191634 -0.245760 0.140850 0.275984 0.282678 0.268029 -0.110149 -0.239872 0.251139 -0.408481 -0.376725 -0.368735 -0.361998 -0.204594 -0.225522 -0.225885 0.024642 -0.683113 -0.670305 0.300575 0.296866 0.289698 0.291266 0.268308 0.246066 0.241058 0.241823 0.233052 0.208881 0.233441 0.229888 0.205152 0.262883 0.224631
chargesum: 0.00000
title: Mulliken charges with hydrogens summed into heavy atoms:
elementType: O O O O O C C C C C C C C C C C C C C C C C C
charge: -0.265205 -0.204548 -0.234383 -0.191634 -0.245760 0.140850 0.275984 0.282678 0.268029 -0.110149 -0.239872 0.251139 -0.111615 -0.087027 -0.077469 -0.093691 0.041472 0.015535 0.015938 0.257694 -0.010902 0.022360 0.300575
polarizability: 2.85714457e+02 -9.58706468e+00 2.75970160e+02 1.69727453e+01 3.61895147e+00 1.03919377e+02
1716.lowfreq: -3.9566 -0.0004 0.0004 0.0008 6.4942 7.6229 28.3642 35.3042 41.1506
frequency: 28.2714 35.2527 41.1480 52.6007 77.6642 98.1217 113.1430 146.3202 167.4329 171.4293 189.7177 203.7066 216.2895 236.6981 249.5518 279.6935 293.5109 335.9758 355.9024 384.5082 393.0449 408.2699 419.0521 421.9043 435.8016 458.4741 474.9984 490.4366 523.8343 586.1620 608.9482 639.8396 651.7049 656.0809 674.7144 685.3004 719.8454 742.1307 766.4171 788.0513 807.5387 820.6789 841.2876 875.5001 884.7553 907.3749 932.0346 934.2635 940.1404 943.7901 954.0867 999.4715 1008.4382 1014.8026 1016.5256 1038.1738 1070.4435 1086.9333 1091.8099 1137.2746 1158.7876 1160.8510 1169.1423 1174.6564 1189.9837 1194.7415 1232.6959 1248.6861 1292.0690 1307.4657 1324.5769 1334.9902 1384.7172 1384.9786 1399.0682 1403.5195 1428.7790 1437.1802 1448.6248 1455.9593 1465.0615 1470.2879 1471.6328 1485.6833 1529.3177 1546.3946 1571.6079 1592.0217 1604.6423 1615.3611 1653.5882 2993.3261 2996.3079 3025.8630 3089.2586 3096.5150 3103.2389 3111.6718 3137.7415 3149.8035 3152.9572 3164.3388 3167.6257 3173.1968 3179.4298
redmass: 3.7358 4.5159 5.5998 5.2402 5.7593 4.6815 4.9240 7.4513 3.8887 8.4576 1.0297 5.3437 4.2644 1.2886 3.7965 5.9023 7.7270 7.1119 3.4229 11.7471 4.2408 4.9919 3.3972 5.1693 4.8967 3.3165 10.5185 3.7359 5.2951 6.5263 6.8032 6.9164 6.0500 8.5074 5.9715 6.5138 2.8321 2.6908 5.9865 3.0998 2.0315 1.8446 6.8662 2.4612 3.0429 6.3749 1.1865 1.6768 4.4073 1.5048 1.6696 1.3903 1.3847 4.9143 1.3713 2.2760 1.9531 2.5099 2.1481 3.8885 2.2552 2.0414 1.2204 1.1326 1.9741 1.9805 3.5024 1.7085 3.1386 3.1885 1.3865 1.3922 2.3906 2.1287 1.2225 10.2863 3.2463 2.7880 2.7277 1.0524 1.0515 1.0844 2.4660 1.0520 9.5862 8.7904 7.2218 6.9213 7.6268 7.5300 11.7851 1.0358 1.0359 1.0867 1.0991 1.0989 1.1006 1.1006 1.0864 1.0875 1.0903 1.0946 1.0927 1.1001 1.0993
irintensity: 0.7354 0.4431 0.3126 6.1885 4.3676 0.6475 0.2434 0.8153 1.6548 1.3657 0.1233 1.1780 0.1528 0.3438 6.8517 4.0234 1.8128 0.2321 0.2041 23.7077 9.5796 2.6368 0.6437 0.9626 5.9203 0.1192 0.0310 1.0567 4.6691 4.0173 2.4477 1.2799 2.8669 20.6864 9.8497 9.9477 53.0071 18.5352 6.1360 18.0147 3.2683 67.9603 34.4117 8.7244 66.6000 7.0792 2.6699 1.7614 21.9637 3.1789 0.5242 2.8616 2.7554 30.2599 0.1127 6.8453 1.5601 10.1329 689.2555 787.8341 7.0763 13.0781 9.8366 4.4096 42.7938 0.9558 0.4339 11.2520 295.2548 277.7727 18.2446 4.0741 5.1788 28.0989 22.0429 4.4048 33.0919 15.1806 3.6012 4.9920 7.1232 7.8797 5.9013 29.3984 32.9897 310.5721 35.2250 7.8024 8.1075 3.1857 232.3268 10.9623 25.5113 8.6819 6.7081 45.6119 25.4377 22.3357 3.5799 6.6232 5.6020 1.5565 1.7874 29.3161 9.6382
temp: 298.150 k
press: 1.00000 atm
elementType: 8 8 8 8 8 6 6 6 6 6 6 6 6 6 6 6 6 6 6 6 6 6 6 1 1 1 1 1 1 1 1 1 1 1 1 1 1
symmnumber: 1
zpe: 724970.6 jmol-1
zpe.correction: 0.276127 hartree
zpe.thermalcorrener: 0.296007 hartree
zpe.thermalcorrenthalpy: 0.296951 hartree
zpe.thermalcorrgfe: 0.226758 hartree
zpe.sumelectzpe: -1068.841568 hartree
zpe.sumelectthermal: -1068.821688 hartree
zpe.sumelectthermalent: -1068.820744 hartree
zpe.sumelectthermalfe: -1068.890937 hartree
dipole: -0.7282 -1.4583 -0.1400
dipole: 1.6360
quadrupole: -121.3789 -105.9161 -140.1404
quadrupole: -6.4035 -4.0565 -0.9691
quadrupole: 1.0996 16.5623 -17.6619 -6.4035 -4.0565 -0.9691
hfenergy: -1069.1176949 hartree
pointgroup: C01 [X(C18H14O5)]
dipole: 0.2095893 0.6080316 -0.0257044 debye
polarizability: 287.833917|-7.1676409|273.8228276|-17.7072239|2.7843696|103.947249 unknown
InChI: InChI=1S/C18H14O5/c1-10(2)22-18(21)23-14-9-5-8-13-15(14)17(20)12-7-4-3-6-11(12)16(13)19/h3-10H,1-2H3
charge 0 multiplicity 1
37 atoms
O  2.181908 -1.06563 -0.635439
O  0.634875 1.229903 -0.503094
O  3.745536 0.47317 -0.290759
O  -3.847381 -1.855919 0.399999
O  2.294029 -0.03582 1.488458
C  -0.284905 -0.995072 -0.200703
C  -1.468242 -1.781374 -0.005247
C  -1.725712 1.122811 -0.090448
C  -2.891424 0.341678 0.14837
C  -0.379255 0.494332 -0.274757
C  -2.811786 -1.145045 0.197451
C  0.945526 -1.697797 -0.374701
C  -1.412986 -3.193746 -0.006168
C  -1.830643 2.534981 -0.144967
C  -4.144213 0.977787 0.332136
C  0.991622 -3.107186 -0.395619
C  -0.187439 -3.857299 -0.212006
C  -3.079153 3.161982 0.036925
C  -4.239574 2.381929 0.277356
C  4.440711 1.541498 0.533183
C  5.850572 1.628533 -0.050606
C  3.628185 2.837794 0.426974
C  2.692654 -0.147438 0.314357
H  -2.34616 -3.742733 0.150104
H  -0.920807 3.113994 -0.329908
H  -5.021458 0.348991 0.513523
H  1.961315 -3.589222 -0.549401
H  -0.143936 -4.950827 -0.222151
H  -3.154212 4.253744 -0.006225
H  -5.208486 2.872094 0.419647
H  4.45518 1.179226 1.578408
H  6.436877 2.38344 0.503709
H  6.36972 0.657845 0.02245
H  5.812541 1.926437 -1.112735
H  4.1156 3.630761 1.023644
H  2.603396 2.692244 0.805696
H  3.56992 3.171333 -0.623653
