program: Gaussian 09
title: 000291735
version: EM64L-G09RevD.01
frameworkgroup: C1[X(C17H23N3O2)]
method: RPBEPBE
basis: SDD
operation: Freq
keyword: #p
keyword: freq=noraman
keyword: PBEPBE/SDD
title: #p freq=noraman PBEPBE/SDD
converged: YES YES NO NO
title: Mulliken charges:
elementType: O O N N N C C C C C C C C C C C C C C C C C H H H H H H H H H H H H H H H H H H H H H H H
charge: -0.235606 -0.191865 -0.104811 -0.365961 0.046974 -0.359074 -0.440649 -0.325639 -0.324369 0.408501 0.318348 -0.172325 -0.290830 0.389695 -0.671586 -0.670191 -0.550698 0.076745 -0.464841 0.171711 -0.764599 -0.784994 0.234202 0.211892 0.250899 0.225338 0.207797 0.192761 0.202857 0.198510 0.333197 0.205691 0.228398 0.210979 0.207968 0.225731 0.213334 0.260055 0.243150 0.213848 0.254784 0.254571 0.230984 0.267608 0.231513
chargesum: 0.00000
title: Mulliken charges with hydrogens summed into heavy atoms:
elementType: O O N N N C C C C C C C C C C C C C C C C C
charge: -0.235606 -0.191865 -0.104811 -0.032764 0.046974 0.087019 0.035588 0.074918 0.076997 0.408501 0.318348 -0.172325 -0.290830 0.389695 -0.026518 -0.023158 -0.290643 0.076745 -0.221691 0.171711 -0.041396 -0.054888
polarizability: 3.52748609e+02 -2.03138733e+01 2.45285110e+02 1.36840306e+01 -5.36654601e+00 1.29328401e+02
1716.lowfreq: -57.2951 -5.3148 -2.7825 0.0002 0.0005 0.0008 3.6151 18.9613 22.8580
frequency: -57.2758 18.9108 22.7227 24.4795 45.8527 64.6682 69.9199 78.7833 81.5523 133.7967 142.7758 161.0566 180.5707 185.4866 205.9115 214.3809 230.9240 247.8391 257.4433 273.1608 287.4202 293.2184 314.1360 358.1709 367.6319 385.0907 410.1399 437.0569 453.5047 469.2020 482.2250 491.9416 516.7067 532.5255 552.2016 570.3652 601.5610 671.5455 695.7191 700.9670 736.1389 753.6040 756.0913 789.1618 794.1139 799.1365 822.5720 865.6878 883.0344 894.8680 914.0595 933.1315 952.3776 990.0083 996.4555 1019.2677 1030.2347 1040.4936 1047.7008 1058.2559 1071.0931 1075.6952 1078.3821 1085.1441 1124.2549 1164.7786 1178.9593 1207.3791 1213.7817 1236.1094 1252.5138 1279.0076 1287.5249 1292.7788 1300.3128 1310.2226 1324.2005 1330.1786 1339.0456 1360.3121 1360.9795 1364.9205 1376.1507 1386.6009 1388.7925 1389.2274 1402.6977 1408.7590 1449.2781 1453.2149 1460.4354 1461.7025 1463.3455 1467.6828 1469.2401 1470.6560 1479.7731 1484.6421 1487.0226 1491.0110 1495.2762 1520.6579 1532.5023 1557.4793 1576.9489 1633.2642 2860.8014 2871.0832 2902.2498 2982.4324 2983.9389 2985.6078 2992.3567 3000.4571 3016.2341 3036.6059 3044.8431 3060.9512 3074.4039 3078.1183 3078.9570 3081.2120 3091.6863 3092.6552 3094.1117 3123.7935 3136.6182 3158.0285 3463.6333
redmass: 1.0175 3.6599 4.7438 4.2702 4.2108 3.4303 3.0277 3.1361 2.3438 5.1244 2.4689 3.4060 2.1080 1.8847 1.3295 1.5464 2.3770 2.7194 2.8774 2.8150 2.5492 2.1723 3.0680 6.5893 6.0276 3.0315 4.0914 5.0727 3.4810 3.5336 3.1943 4.9696 6.7049 4.0427 4.6110 3.9437 5.3804 1.1899 4.2229 2.8386 3.4537 2.9360 6.2946 1.3412 1.1624 1.2340 2.5581 2.7907 5.7264 1.2885 1.9792 3.1581 5.3807 2.3166 1.6577 3.7155 1.5548 1.5715 1.6572 2.1321 2.5541 1.8940 2.9811 2.1532 1.8243 2.0119 2.0593 2.3237 3.0061 1.6497 1.7062 1.2097 1.8150 1.5057 1.2711 2.7521 1.3336 3.2122 5.4569 1.4706 3.6166 1.3205 1.3458 1.2344 1.3215 1.2307 1.2181 3.3323 1.0514 1.2484 1.0709 1.2038 1.0548 1.0470 1.0743 1.0624 1.0582 1.0734 1.0834 1.0754 2.5801 3.6131 6.3267 6.9784 6.3812 8.1288 1.0721 1.0711 1.0702 1.0357 1.0385 1.0357 1.0365 1.0636 1.0880 1.0876 1.0888 1.0968 1.0983 1.0953 1.0985 1.1017 1.1004 1.1004 1.1018 1.0982 1.0924 1.0911 1.0760
irintensity: 0.3179 0.2357 1.8716 1.3254 0.8264 1.3735 1.0771 1.0282 0.3379 0.2092 0.8374 1.3985 0.6144 2.7256 1.0037 0.4621 0.3060 0.4243 0.6194 3.4259 0.5644 1.8461 3.2481 10.4928 6.2758 12.3404 3.1372 1.5488 17.4272 3.4707 5.5791 1.2384 4.6042 6.4712 1.1305 0.1553 0.5339 106.3885 9.0374 3.4550 6.1240 2.3097 0.3967 1.3488 5.2889 10.2674 17.1013 18.6376 7.4440 7.9147 0.6054 25.2717 13.9486 3.0534 8.3274 23.0087 4.4017 3.4937 14.7432 7.7669 50.0034 43.9075 27.0401 2.0560 7.6895 18.7136 19.4071 37.3918 100.6061 1.9181 21.6944 11.9610 72.6890 14.6859 23.4822 75.1192 3.0440 17.1366 118.7641 5.2510 8.8621 7.6548 7.6202 31.8042 55.0937 23.5597 40.1326 2.3429 17.1637 97.1095 8.9731 2.4387 9.2816 16.5559 3.6287 11.3150 6.5467 13.7823 25.2628 16.8899 195.7852 19.6358 73.9945 246.5926 168.9535 325.3542 57.4016 113.8113 54.4442 32.7226 14.3912 35.4001 13.9609 40.6194 26.8482 14.0786 17.3312 15.3638 60.7990 6.4238 54.5014 34.0922 31.3140 48.8097 32.2472 5.3867 18.3695 11.2830 76.5252
temp: 298.150 k
press: 1.00000 atm
elementType: 8 8 7 7 7 6 6 6 6 6 6 6 6 6 6 6 6 6 6 6 6 6 1 1 1 1 1 1 1 1 1 1 1 1 1 1 1 1 1 1 1 1 1 1 1
symmnumber: 1
zpe: 975331.4 jmol-1
zpe.correction: 0.371484 hartree
zpe.thermalcorrener: 0.393896 hartree
zpe.thermalcorrenthalpy: 0.394840 hartree
zpe.thermalcorrgfe: 0.317636 hartree
zpe.sumelectzpe: -974.649732 hartree
zpe.sumelectthermal: -974.627320 hartree
zpe.sumelectthermalent: -974.626376 hartree
zpe.sumelectthermalfe: -974.703580 hartree
dipole: -1.0182 4.3164 0.5745
dipole: 4.4719
quadrupole: -98.6607 -146.8376 -131.7151
quadrupole: 9.4553 -0.6199 0.6786
quadrupole: 27.0771 -21.0998 -5.9773 9.4553 -0.6199 0.6786
hfenergy: -975.0212159 hartree
pointgroup: C01 [X(C17H23N3O2)]
dipole: -0.4442885 1.6754028 -0.3017822 debye
polarizability: 352.7610799|-11.0786233|230.9866641|23.9108498|-37.2181181|143.6143751 unknown
InChI: InChI=1S/C17H23N3O2/c1-5-20(6-2)8-7-18-13-10-14(21)16-15(17(13)22)11(3)9-12(4)19-16/h9-10,18H,5-8H2,1-4H3
charge 0 multiplicity 1
45 atoms
O  0.843014 2.4502 -1.140189
O  1.03223 -2.666325 0.862807
N  -4.80499 -0.120742 0.154549
N  -1.395758 1.045831 -1.076182
N  3.409539 -1.244496 0.768224
C  -3.49657 0.564648 0.237704
C  -2.741693 0.469598 -1.12032
C  -5.889118 0.558787 0.913464
C  -4.709654 -1.580207 0.439555
C  -0.282743 0.412893 -0.588823
C  2.2446 0.695514 -0.203525
C  0.962369 1.26765 -0.669439
C  2.277018 -0.641042 0.31711
C  3.47438 1.438145 -0.253937
C  -6.384073 1.847879 0.230298
C  -5.822418 -2.403469 -0.235996
C  -0.231071 -0.87789 -0.077933
C  1.003348 -1.480451 0.395038
C  4.634909 0.785654 0.220336
C  4.582587 -0.540008 0.722057
C  3.588464 2.852785 -0.778054
C  5.820366 -1.243951 1.230655
H  -2.85081 0.152096 1.048566
H  -3.654799 1.632232 0.472759
H  -3.33334 0.997302 -1.88735
H  -2.676903 -0.589676 -1.434673
H  -6.737078 -0.145767 0.985229
H  -5.574684 0.782653 1.964056
H  -3.732613 -1.93626 0.060996
H  -4.705802 -1.777041 1.540965
H  -1.229458 2.005963 -1.401746
H  -5.583071 2.605022 0.14342
H  -6.751859 1.622097 -0.785726
H  -7.207098 2.301542 0.813399
H  -6.82661 -2.115712 0.124196
H  -5.797701 -2.25289 -1.329257
H  -5.687301 -3.479871 -0.021944
H  -1.125081 -1.504048 -0.001102
H  5.594907 1.313214 0.200685
H  4.633777 3.20136 -0.716715
H  3.242758 2.924684 -1.824054
H  2.941392 3.546111 -0.212945
H  6.280561 -0.688377 2.069197
H  5.551578 -2.253445 1.575642
H  6.586204 -1.328597 0.436902
