program: Gaussian 09
title: 000291712
version: EM64L-G09RevD.01
frameworkgroup: C1[X(C13H10N2O2S)]
method: RPBEPBE
basis: SDD
operation: Freq
keyword: #p
keyword: freq=noraman
keyword: PBEPBE/SDD
title: #p freq=noraman PBEPBE/SDD
converged: NO YES NO NO
title: Mulliken charges:
elementType: S O O N N C C C C C C C C C C C C C H H H H H H H H H H
charge: 0.284743 -0.206942 -0.205618 0.021879 -0.363084 -0.149435 0.380764 -0.259479 0.429490 -0.265594 -0.368794 -0.177452 -0.370390 -0.343834 -0.220630 -0.216628 -0.278430 -0.226949 0.333980 0.249646 0.288513 0.241543 0.226857 0.267076 0.232425 0.236705 0.225176 0.234460
chargesum: 0.00000
title: Mulliken charges with hydrogens summed into heavy atoms:
elementType: S O O N N C C C C C C C C C C C C C
charge: 0.284743 -0.206942 -0.205618 0.021879 -0.363084 -0.149435 0.380764 0.074501 0.429490 -0.015947 -0.080282 0.064092 -0.143533 -0.076758 0.011795 0.020077 -0.053254 0.007512
polarizability: 3.32671068e+02 2.14286083e+01 2.12439043e+02 -1.35977818e+00 7.51233992e-01 6.47567143e+01
1716.lowfreq: -7.5829 -4.7050 -0.0016 -0.0008 -0.0005 1.1930 19.4990 28.8660 32.0591
frequency: 19.4293 28.8470 32.0478 57.2546 92.3089 116.0370 153.1100 180.0184 196.5407 204.6425 236.4941 277.2850 317.8105 369.7156 399.7644 402.6323 423.1244 457.2990 495.4114 500.2958 525.9950 569.9871 613.8315 644.4360 668.8428 690.4830 697.0027 702.5349 707.4180 769.7216 804.7052 819.5030 846.2993 854.9839 921.2067 925.5364 957.1038 967.1954 983.7575 986.4432 988.7157 990.5053 1006.8716 1023.5083 1052.3445 1082.1444 1084.9618 1109.6987 1174.6875 1176.1255 1184.4886 1215.8346 1231.6738 1266.6700 1314.2449 1349.4307 1371.4495 1390.4316 1393.6547 1428.5371 1436.4265 1453.6777 1482.1061 1542.1198 1582.0214 1591.7687 1600.5877 1612.0608 3006.4191 3122.3858 3135.6664 3139.0789 3148.5001 3161.2986 3162.9802 3172.7533 3189.9409 3193.3353
redmass: 5.0620 4.7834 7.4041 12.4727 5.4079 6.6385 6.0705 4.8469 4.7766 7.1704 8.4252 3.5500 6.8397 11.7677 8.3283 2.8035 3.3095 8.3899 5.1029 3.0362 6.7939 8.1375 6.4763 7.4549 3.1995 9.5512 1.7943 3.7432 9.9835 1.6926 1.5063 9.1047 4.6097 1.2538 1.3815 1.3606 1.3693 1.5817 6.2921 1.3869 6.2376 1.3499 1.3419 2.1435 1.6749 1.8961 1.5743 3.1972 1.0683 1.1418 1.1152 8.6320 2.3257 1.3508 1.4608 1.4830 9.5758 6.8497 5.8678 3.1447 2.3583 2.4185 2.3503 5.7376 6.9010 5.8816 7.2844 6.0945 1.0895 1.0877 1.0871 1.0888 1.0916 1.0962 1.0942 1.1010 1.0910 1.0961
irintensity: 0.7863 0.7795 0.8514 0.2875 0.0100 0.5998 0.1104 13.5089 0.4074 5.3913 1.1422 2.2794 2.6333 0.2742 2.3372 0.0376 0.8488 16.3485 1.6019 19.6189 0.0895 36.8972 0.0325 3.9955 8.4638 55.9238 41.2310 46.9402 12.6687 49.3825 45.2392 20.8094 2.1357 0.1096 1.5410 0.0448 14.4882 28.9765 0.4200 0.0152 0.2113 0.4861 1.0934 5.7649 8.7539 26.9077 6.5857 45.7220 1.5209 7.6572 5.9258 247.4487 20.1767 9.3014 4.6965 2.5032 98.6875 19.9842 0.8025 11.3383 11.4103 127.4203 10.1478 20.7574 6.4902 1.1724 73.8116 0.9867 26.1081 6.4216 0.9376 3.7971 16.3172 25.4286 14.8507 22.9880 17.6550 4.2440
temp: 298.150 k
press: 1.00000 atm
elementType: 16 8 8 7 7 6 6 6 6 6 6 6 6 6 6 6 6 6 1 1 1 1 1 1 1 1 1 1
symmnumber: 1
zpe: 527470.4 jmol-1
zpe.correction: 0.200903 hartree
zpe.thermalcorrener: 0.216636 hartree
zpe.thermalcorrenthalpy: 0.217580 hartree
zpe.thermalcorrgfe: 0.154611 hartree
zpe.sumelectzpe: -1158.027035 hartree
zpe.sumelectthermal: -1158.011302 hartree
zpe.sumelectthermalent: -1158.010358 hartree
zpe.sumelectthermalfe: -1158.073327 hartree
dipole: 2.3995 -4.6901 0.0244
dipole: 5.2683
quadrupole: -86.9469 -112.1834 -116.4858
quadrupole: 15.5469 -0.4055 0.3952
quadrupole: 18.2585 -6.9780 -11.2804 15.5469 -0.4055 0.3952
hfenergy: -1158.2279379 hartree
pointgroup: C01 [X(C13H10N2O2S1)]
dipole: -1.0394111 1.7709944 0.2817525 debye
polarizability: 329.0385132|29.3316478|213.7332198|-12.8260672|14.4451559|67.0950929 unknown
InChI: InChI=1S/C13H10N2O2S/c16-15(17)12-7-4-8-13(9-12)18-14-10-11-5-2-1-3-6-11/h1-10H
charge 0 multiplicity 1
28 atoms
S  0.175647 2.585037 0.112844
O  4.202756 -2.408453 -0.741261
O  1.928128 -2.479115 -0.610965
N  3.050675 -1.841785 -0.60051
N  -0.958486 1.160364 0.036503
C  1.744821 1.656538 -0.090801
C  3.018934 -0.365577 -0.415476
C  1.766207 0.259523 -0.265074
C  -3.23649 0.332446 0.084703
C  2.94831 2.402989 -0.069002
C  4.239764 0.342717 -0.400096
C  4.186927 1.741399 -0.223983
C  -4.616098 0.665204 0.177031
C  -2.857431 -1.033391 -0.050905
C  -5.599774 -0.345121 0.133945
C  -3.842158 -2.037462 -0.092765
C  -2.244076 1.421232 0.133068
C  -5.215604 -1.698628 -0.00093
H  0.839193 -0.317122 -0.281721
H  2.924753 3.489944 0.067674
H  5.182442 -0.1953 -0.522273
H  5.113131 2.324176 -0.206189
H  -4.914044 1.71583 0.281964
H  -1.794773 -1.285962 -0.12119
H  -6.659782 -0.079472 0.205362
H  -3.544997 -3.086389 -0.197062
H  -2.655521 2.44113 0.252113
H  -5.977553 -2.484852 -0.034205
