program: Gaussian 09
title: 000291858
version: EM64L-G09RevD.01
frameworkgroup: C1[X(C20H8Cl4O7)]
method: RPBEPBE
basis: SDD
operation: Freq
keyword: #p
keyword: freq=noraman
keyword: PBEPBE/SDD
title: #p freq=noraman PBEPBE/SDD
converged: YES YES NO NO
title: Mulliken charges:
elementType: Cl Cl Cl Cl O O O O O O O C C C C C C C C C C C C C C C C C C C C H H H H H H H H
charge: 0.052159 0.060199 0.073889 0.078387 -0.372007 -0.387075 -0.374154 -0.380695 -0.201390 -0.394006 -0.180139 0.245674 0.318011 0.282300 0.348039 0.067620 0.079012 -0.354205 0.409545 -0.312490 -0.001252 -0.031715 -0.361021 -0.394745 0.158863 -0.327078 0.021391 -0.363111 -0.102718 -0.153204 0.014408 0.247836 0.247014 0.230840 0.258586 0.372888 0.361731 0.367674 0.394939
chargesum: 0.00000
title: Mulliken charges with hydrogens summed into heavy atoms:
elementType: Cl Cl Cl Cl O O O O O O O C C C C C C C C C C C C C C C C C C C C
charge: 0.052159 0.060199 0.073889 0.078387 -0.372007 -0.014187 -0.012423 -0.013021 -0.201390 0.000933 -0.180139 0.245674 0.318011 0.282300 0.348039 0.067620 0.079012 -0.106369 0.409545 -0.065476 -0.001252 -0.031715 -0.361021 -0.163905 0.158863 -0.068493 0.021391 -0.363111 -0.102718 -0.153204 0.014408
polarizability: 3.78038302e+02 2.37747999e+01 4.12157555e+02 -7.03493684e+00 -2.17735723e+01 2.15647264e+02
1716.lowfreq: -4.9411 -4.6983 -2.2737 0.0013 0.0022 0.0024 17.6643 26.8625 29.0920
frequency: 17.5670 26.8469 29.0843 37.6535 49.0715 57.6677 65.4704 71.6419 84.3119 106.2275 107.5694 122.3999 146.5851 158.5499 169.9820 179.3980 202.9643 213.6187 216.8217 246.7663 250.7566 254.4167 276.4810 287.3578 292.6331 296.1019 309.1259 317.7438 323.7150 333.3338 338.0250 347.4659 356.0360 384.6298 408.9966 430.4113 444.7877 457.5754 479.1396 512.4924 520.8970 525.1058 530.2038 551.5736 566.7925 575.3811 586.6902 600.8889 607.0846 628.9071 635.6956 647.9210 662.0942 678.9456 704.5272 714.3122 722.8735 738.9517 764.1723 774.8013 782.2312 794.0462 830.3368 832.2143 849.8301 876.9218 916.6712 922.9381 974.8544 988.2336 1022.8747 1036.9331 1075.6380 1115.3857 1138.1654 1156.0347 1158.3143 1167.0665 1187.5333 1224.4926 1233.5579 1273.2341 1275.4985 1291.6974 1316.9407 1329.1530 1348.1761 1361.4296 1365.8634 1393.6852 1398.9490 1437.7852 1445.2809 1495.3904 1512.8084 1519.0012 1549.5686 1562.5029 1573.0085 1590.1272 1619.1679 1648.1858 1653.7350 3132.5232 3147.6819 3172.3440 3173.1627 3497.4031 3556.0267 3562.3278 3576.0082
redmass: 13.5657 13.2160 11.2048 9.5121 7.4589 9.5768 6.3683 19.6422 18.9740 7.3752 9.7095 7.8531 9.4724 10.0274 11.4398 12.1589 31.8625 30.9858 14.8288 9.8875 5.8440 5.7440 4.9312 11.2692 6.7268 3.2152 9.9352 4.6064 24.6708 8.0422 1.5876 26.0407 11.9102 1.1753 1.1485 8.0661 6.4938 7.2048 7.3588 5.6945 6.7962 9.6418 5.5809 4.6673 6.4996 5.8319 3.8608 7.9127 5.8765 1.8984 7.6092 5.3594 6.9447 4.6159 8.7404 8.0378 5.5617 6.5083 3.7524 10.2352 8.6893 1.9958 1.9043 9.3434 10.7359 6.3906 1.3536 5.8303 1.3020 3.3996 5.1835 3.7052 3.9347 2.5089 1.9847 2.0793 1.7082 2.1176 1.9973 1.9090 3.4236 3.0607 3.0150 2.2272 2.3195 10.6023 7.3558 2.2168 3.8925 6.8658 4.8493 6.8366 6.3769 5.7925 5.5170 11.6115 10.4442 9.7474 8.7982 8.7039 6.3929 8.4194 10.1091 1.0895 1.0870 1.0948 1.0981 1.0639 1.0651 1.0650 1.0663
irintensity: 0.6384 0.4463 0.5014 1.1907 0.1180 0.2873 0.0511 0.2018 0.2652 5.0926 0.5062 0.1192 1.6300 0.6809 0.8701 2.2692 0.0567 0.0807 0.7340 0.2842 0.7082 0.6252 2.0610 3.5475 19.0505 2.3481 9.6522 7.8040 0.3001 2.5082 1.2300 0.2696 2.6424 43.9959 327.2153 7.7117 5.8840 19.1541 0.7208 11.8305 7.0894 9.3822 3.0799 14.9401 46.6034 7.9360 0.9720 27.7217 12.8534 161.7114 21.4361 10.3627 8.3870 38.7386 1.0502 6.2570 1.5646 1.6697 11.1252 3.3033 1.5003 25.3174 38.6442 2.0369 4.4283 14.6786 1.3330 63.1212 0.5099 58.4018 128.5206 72.2706 106.9153 392.4077 54.7925 108.6611 315.1376 221.7937 9.5038 32.7672 27.8556 77.2253 101.8211 69.4021 113.5144 4.3360 71.5843 25.9798 61.8305 114.8048 15.8149 3.7968 104.5846 184.5610 191.0929 14.1116 13.0805 6.1244 111.3991 131.7717 265.4006 13.2473 157.9733 13.7812 2.7703 6.1124 7.3647 40.8084 1.7559 67.8875 132.4101
temp: 298.150 k
press: 1.00000 atm
elementType: 17 17 17 17 8 8 8 8 8 8 8 6 6 6 6 6 6 6 6 6 6 6 6 6 6 6 6 6 6 6 6 1 1 1 1 1 1 1 1
symmnumber: 1
zpe: 611364.6 jmol-1
zpe.correction: 0.232856 hartree
zpe.thermalcorrener: 0.261146 hartree
zpe.thermalcorrenthalpy: 0.262090 hartree
zpe.thermalcorrgfe: 0.172003 hartree
zpe.sumelectzpe: -3131.537233 hartree
zpe.sumelectthermal: -3131.508943 hartree
zpe.sumelectthermalent: -3131.507999 hartree
zpe.sumelectthermalfe: -3131.598086 hartree
dipole: -3.1733 -8.1339 2.1124
dipole: 8.9829
quadrupole: -222.2865 -217.8157 -199.9156
quadrupole: -20.2816 7.6959 -2.0085
quadrupole: -8.9472 -4.4764 13.4237 -20.2816 7.6959 -2.0085
hfenergy: -3131.7700892 hartree
pointgroup: C01 [X(C20H8Cl4O7)]
dipole: 1.1006694 3.3579965 0.0504156 debye
polarizability: 375.8932351|22.4247421|413.814381|-2.2143283|-24.4951335|216.1355054 unknown
InChI: InChI=1S/C20H8Cl4O7/c21-12-10(11(20(29)30)13(22)15(24)14(12)23)9-5-1-3-7(25)16(27)18(5)31-19-6(9)2-4-8(26)17(19)28/h1-4,25,27-29H
charge 0 multiplicity 1
39 atoms
Cl 1.105936 0.352432 -2.974625
Cl 4.599579 0.063271 2.397979
Cl 4.306862 0.60027 -3.134715
Cl 6.062027 0.461461 -0.443464
O  -2.934837 -0.13119 -0.096722
O  -4.529399 2.110515 -0.177462
O  -4.229063 -2.584635 0.041857
O  -3.444181 4.603662 -0.308834
O  -2.715885 -4.928109 0.132378
O  0.840119 0.899688 2.708835
O  1.609159 -1.285856 2.927017
C  -0.063631 0.0132 -0.155267
C  -0.862216 1.228214 -0.197915
C  -0.691423 -1.236901 -0.0734
C  1.43072 0.118275 -0.223632
C  -2.282006 1.116848 -0.169704
C  -2.141258 -1.320404 -0.042755
C  -0.315273 2.53984 -0.25786
C  2.221171 0.035505 0.954624
C  0.028328 -2.501265 -0.031599
C  -3.142221 2.232147 -0.205918
C  -2.839295 -2.512402 0.021464
C  2.091433 0.289973 -1.465137
C  -1.149325 3.666978 -0.295975
C  -2.562208 3.52746 -0.273461
C  -0.63786 -3.701447 0.035933
C  -2.113668 -3.804287 0.069735
C  3.62846 0.13466 0.880055
C  3.499824 0.389491 -1.545353
C  4.275443 0.317846 -0.362329
C  1.550574 -0.221581 2.281932
H  0.770054 2.668599 -0.26158
H  1.122129 -2.477432 -0.050361
H  -0.710662 4.670949 -0.341105
H  -0.098581 -4.653634 0.072099
H  -4.77628 1.151052 -0.139536
H  -4.617703 -1.673958 -0.006497
H  -2.95423 5.462395 -0.360452
H  0.389687 0.702071 3.576253
