program: Gaussian 09
title: 000291775
version: EM64L-G09RevD.01
frameworkgroup: C1[X(C22H21NO4)]
method: RPBEPBE
basis: SDD
operation: Freq
keyword: #p
keyword: freq=noraman
keyword: PBEPBE/SDD
title: #p freq=noraman PBEPBE/SDD
converged: YES YES NO NO
title: Mulliken charges:
elementType: O O O O N C C C C C C C C C C C C C C C C C C C C C C H H H H H H H H H H H H H H H H H H H H H
charge: -0.252896 -0.325155 -0.266609 -0.230224 -0.467141 0.179366 -0.003038 0.194229 0.035495 0.345269 0.313986 0.118006 0.149055 -0.362469 -0.404010 -0.383255 -0.408236 -0.246454 -0.249897 -0.243715 -0.242393 -0.249925 -0.238194 -0.215454 -0.208299 -0.676378 -0.677003 0.359501 0.248626 0.243282 0.301890 0.231138 0.225901 0.226526 0.231465 0.228151 0.227284 0.231632 0.223821 0.227946 0.230550 0.228750 0.228793 0.243209 0.205926 0.225611 0.229177 0.216159
chargesum: 0.00000
title: Mulliken charges with hydrogens summed into heavy atoms:
elementType: O O O O N C C C C C C C C C C C C C C C C C C C C C C
charge: -0.252896 -0.325155 -0.266609 -0.230224 -0.107640 0.179366 -0.003038 0.194229 0.035495 0.345269 0.313986 0.118006 0.149055 -0.113844 -0.160728 -0.081365 -0.177098 -0.020553 -0.023371 -0.012251 -0.014242 -0.022641 -0.006562 0.236314 0.251000 0.001551 -0.006055
polarizability: 3.76110725e+02 2.84091502e+01 3.08792170e+02 -9.70825567e+00 3.17912387e+01 1.61847241e+02
1716.lowfreq: -3.1968 -0.0004 0.0006 0.0006 2.2940 3.1138 21.0730 29.6369 32.7464
frequency: 21.0477 29.5822 32.6930 44.5388 51.7377 52.7296 59.4403 65.7394 68.9685 81.6236 91.6534 111.9781 120.5948 138.8892 170.5308 190.3593 216.4055 221.0075 231.0421 245.1441 254.4059 259.6386 274.5573 312.8071 317.1820 354.1517 366.5706 389.6842 405.9867 408.1184 421.2884 463.9103 500.7067 519.8847 556.8503 611.5758 614.3589 620.3125 644.1816 663.0607 686.3138 699.6885 703.5655 711.8066 720.9814 730.8085 749.2509 770.4681 777.4601 784.5310 798.2615 799.5013 800.7792 835.1602 850.4207 856.0612 858.4910 925.0908 933.5829 963.9953 976.2588 977.7596 983.5922 988.1650 989.7721 993.5517 1004.9826 1020.4252 1026.7883 1032.5878 1037.5544 1071.5952 1084.3740 1088.6715 1099.1762 1112.0078 1114.4294 1134.5354 1137.6320 1172.5199 1175.2529 1195.1042 1200.7464 1205.9974 1247.4765 1248.6530 1249.7226 1276.5219 1306.6112 1319.0844 1338.1855 1352.0155 1358.0681 1372.9826 1377.6434 1400.2976 1402.0779 1411.4968 1424.7747 1436.8992 1454.2141 1460.1660 1463.1392 1465.2134 1472.3738 1475.3391 1483.2173 1486.9310 1488.6974 1525.6686 1552.2383 1579.7435 1584.8991 1601.9610 1614.3528 1616.4294 1637.6027 2994.1497 2995.1262 3005.7675 3009.3461 3064.6046 3066.6447 3091.2013 3091.8843 3104.0479 3107.6204 3117.7198 3119.3970 3128.9530 3131.6167 3142.1722 3144.9088 3157.3191 3161.2130 3172.7391 3174.3223 3581.8024
redmass: 2.9445 3.9342 4.4917 4.4874 3.5691 3.6404 4.0654 3.9481 4.3414 3.0182 5.2662 3.4121 3.8083 4.4446 3.2710 4.5412 4.3827 3.3818 6.4348 2.6971 1.4727 1.7702 4.3228 7.5707 8.4074 4.2458 3.8839 5.0272 2.8733 2.9072 5.2813 5.6968 4.2350 4.6390 6.4745 6.0207 6.4415 5.7076 5.9731 7.0391 6.0437 1.8630 1.8997 1.2694 4.0002 4.6201 4.0109 5.8318 2.5854 2.5819 1.5278 1.1363 2.1003 4.0730 1.2813 2.6598 1.4855 1.4469 1.4292 5.9432 1.4897 4.9804 1.3699 5.6511 3.6289 1.5438 1.3531 2.3655 2.4640 2.5797 2.2399 3.3294 2.1649 1.8715 2.8750 2.1979 2.2091 1.4571 1.4683 1.0532 1.0579 1.1614 1.4575 2.2990 1.1499 1.6934 1.1317 4.7641 3.3366 1.4200 1.6632 1.4432 1.4331 4.7022 6.6455 1.2970 1.2793 3.8578 3.2326 2.4263 3.1056 2.6303 1.0402 1.0406 1.0846 1.0568 2.2261 1.0933 1.1232 5.2274 6.1291 6.0727 6.0936 10.4316 5.8871 6.1885 11.8764 1.0357 1.0360 1.0578 1.0581 1.1067 1.1064 1.0985 1.0986 1.1028 1.1024 1.0869 1.0853 1.0882 1.0875 1.0937 1.0933 1.0981 1.0976 1.0986 1.0976 1.0804
irintensity: 0.3235 0.0362 1.3964 0.6074 0.4281 0.0683 0.6862 0.4770 0.3477 1.2620 0.6958 0.9185 1.4188 2.0523 3.4376 6.5559 1.3545 0.6505 0.7036 2.7568 1.3825 0.7178 2.6425 12.7565 4.3081 11.3628 2.2103 1.8347 0.0542 0.9014 0.4131 2.9034 3.0819 9.6040 14.0322 0.2262 0.4008 0.1002 1.8839 1.2258 0.2956 38.7456 56.9163 62.1026 41.7642 2.4725 65.0101 13.7284 17.6183 29.6080 2.6390 0.7749 11.4582 0.5398 1.6208 0.5926 4.1839 5.5647 12.0581 262.7762 3.1505 26.3186 7.1254 1.6385 0.1525 0.0685 5.6720 42.8358 18.1657 190.2286 13.7775 142.7154 81.4232 10.2874 273.1082 3.1306 13.5202 5.4000 5.0841 0.0484 2.3541 10.6420 51.1706 193.5109 2.2930 250.7549 0.3771 34.3337 20.8934 6.3490 3.6052 3.1556 0.8749 9.1970 8.2120 30.8087 26.3329 28.3660 23.4917 9.2876 38.7659 44.1867 11.2182 12.5434 3.8331 8.5171 98.7611 16.2684 9.1447 17.6446 85.7016 32.8608 19.0286 183.5741 2.3519 0.1179 339.9386 22.6145 20.7073 22.2731 23.7427 10.1153 6.2592 34.9382 28.8435 45.3306 34.9575 7.7295 3.6500 3.0911 1.7106 30.2601 29.3158 40.1893 17.0469 31.7229 7.5068 101.7452
temp: 298.150 k
press: 1.00000 atm
elementType: 8 8 8 8 7 6 6 6 6 6 6 6 6 6 6 6 6 6 6 6 6 6 6 6 6 6 6 1 1 1 1 1 1 1 1 1 1 1 1 1 1 1 1 1 1 1 1 1
symmnumber: 1
zpe: 993091.2 jmol-1
zpe.correction: 0.378248 hartree
zpe.thermalcorrener: 0.403768 hartree
zpe.thermalcorrenthalpy: 0.404712 hartree
zpe.thermalcorrgfe: 0.319806 hartree
zpe.sumelectzpe: -1204.696395 hartree
zpe.sumelectthermal: -1204.670876 hartree
zpe.sumelectthermalent: -1204.669932 hartree
zpe.sumelectthermalfe: -1204.754838 hartree
dipole: -2.3497 0.6241 1.2708
dipole: 2.7433
quadrupole: -132.2326 -143.8892 -156.8112
quadrupole: -14.2364 -2.2004 1.7022
quadrupole: 12.0784 0.4218 -12.5002 -14.2364 -2.2004 1.7022
hfenergy: -1205.0746439 hartree
pointgroup: C01 [X(C22H21N1O4)]
dipole: 0.7148779 -0.5742447 0.5692577 debye
polarizability: 384.8343637|-12.753537|289.0777667|-7.7275573|-49.2406456|172.8380058 unknown
InChI: InChI=1S/C22H21NO4/c1-3-26-21(24)18-17(15-11-7-5-8-12-15)20(22(25)27-4-2)23-19(18)16-13-9-6-10-14-16/h5-14,23H,3-4H2,1-2H3
charge 0 multiplicity 1
48 atoms
O  -0.487887 2.806679 0.248552
O  -0.433349 -3.74681 0.447792
O  1.140544 2.696546 -1.408056
O  -2.576486 -2.793819 0.414131
N  0.828463 -1.474157 0.104616
C  -0.951048 -0.087898 -0.17262
C  0.277159 0.650298 -0.370338
C  1.377712 -0.2433 -0.202555
C  -0.570034 -1.421868 0.12327
C  -2.321487 0.446059 -0.355633
C  2.843849 -0.075596 -0.201136
C  0.38025 2.111235 -0.589785
C  -1.33232 -2.65209 0.330941
C  -3.363449 0.164793 0.565568
C  -2.611059 1.27001 -1.478234
C  3.503982 0.831513 -1.076226
C  3.634776 -0.873439 0.678524
C  -4.652333 0.70814 0.380473
C  -3.900786 1.807801 -1.667582
C  4.91182 0.926467 -1.071368
C  5.040867 -0.777288 0.674237
C  -4.928211 1.533307 -0.734406
C  5.687849 0.123059 -0.204419
C  -0.57256 4.283268 0.033996
C  -1.065384 -5.07771 0.674865
C  -1.650529 4.796177 0.983186
C  0.067566 -6.087228 0.83251
H  1.338341 -2.349511 0.227873
H  -3.163319 -0.479459 1.426078
H  -1.824846 1.471127 -2.21583
H  2.907961 1.45503 -1.747963
H  3.1471 -1.540565 1.400131
H  -5.442697 0.481926 1.104765
H  -4.106554 2.431421 -2.544974
H  5.403391 1.629143 -1.753132
H  5.629918 -1.392119 1.363759
H  -5.93171 1.949326 -0.879262
H  6.780668 0.200928 -0.207918
H  -0.819592 4.465522 -1.028049
H  0.421659 4.721335 0.236783
H  -1.715245 -5.305013 -0.189484
H  -1.703273 -5.013009 1.574991
H  -1.382604 4.586529 2.032845
H  -2.619276 4.313799 0.768395
H  -1.766424 5.889135 0.864107
H  0.706806 -5.833619 1.695845
H  0.697286 -6.120567 -0.073285
H  -0.352404 -7.096006 0.998325
