program: Gaussian 09
title: 000291710
version: EM64L-G09RevD.01
frameworkgroup: C1[X(C12H10N2O2S)]
method: RPBEPBE
basis: SDD
operation: Freq
keyword: #p
keyword: freq=noraman
keyword: PBEPBE/SDD
title: #p freq=noraman PBEPBE/SDD
converged: YES YES NO NO
title: Mulliken charges:
elementType: S O O N N C C C C C C C C C C C C H H H H H H H H H H
charge: 0.463850 -0.203942 -0.207016 -0.857332 0.011759 -0.390223 0.448055 0.567315 -0.114906 -0.340381 -0.251940 -0.200881 -0.424250 -0.378376 -0.191767 -0.207499 -0.265740 0.293051 0.287912 0.331120 0.242265 0.244047 0.220048 0.247307 0.224375 0.224204 0.228943
chargesum: 0.00000
title: Mulliken charges with hydrogens summed into heavy atoms:
elementType: S O O N N C C C C C C C C C C C C
charge: 0.463850 -0.203942 -0.207016 -0.526212 0.011759 -0.390223 0.448055 0.567315 0.178145 -0.052469 -0.009674 0.043166 -0.204201 -0.131069 0.032608 0.016705 -0.036797
polarizability: 2.70560579e+02 3.97622330e+00 1.53456257e+02 -1.69051739e+01 5.62369835e-01 1.18658078e+02
1716.lowfreq: -9.1760 -4.2633 -0.0020 -0.0020 -0.0018 3.0959 25.0722 33.6426 34.1248
frequency: 24.9386 33.6389 34.1022 98.0092 122.2997 165.7082 176.5285 198.6879 228.2678 262.4062 288.2129 358.8898 376.7804 406.4640 430.8501 446.0631 466.9364 496.2618 507.3364 535.3025 564.7718 611.1724 640.0367 661.3798 674.8204 692.7257 722.0340 735.0779 759.0641 785.5529 789.4143 825.7255 847.5528 887.7544 892.0787 961.9334 979.7978 981.9274 982.7599 1003.6275 1018.5892 1024.0480 1031.9336 1084.9144 1092.6381 1137.3989 1170.0130 1172.5987 1184.1952 1209.9647 1243.6483 1251.5238 1299.7913 1352.5502 1358.5324 1394.1001 1402.2944 1424.9419 1441.6566 1459.9362 1481.3196 1571.7207 1592.1782 1593.9738 1613.5792 3112.9661 3129.4949 3140.3831 3144.0185 3153.0457 3160.0744 3168.7979 3169.5788 3183.5441 3552.9587
redmass: 7.0145 5.8214 4.2473 10.1953 4.3816 5.7191 9.3424 6.0466 6.0615 6.4654 6.8659 9.8294 9.0443 2.8949 3.4734 1.8941 3.0861 3.3887 2.9638 6.9702 6.3435 6.3276 7.0504 5.4954 8.5308 1.9193 3.5862 5.1499 1.7343 1.4983 6.6983 1.2587 5.3457 1.4524 1.3559 1.3627 4.4554 1.4201 1.3434 1.3353 7.1087 2.1279 2.3430 1.5714 2.7062 1.7669 1.0496 1.1142 1.1094 5.5281 1.6327 1.9188 1.7283 9.2309 1.6789 5.9282 3.2496 2.5877 2.3918 2.0882 2.4489 6.9252 6.0100 6.2003 6.2088 1.0874 1.0859 1.0924 1.0866 1.0945 1.0898 1.1007 1.0953 1.0990 1.0769
irintensity: 0.0980 1.2604 0.1186 0.2237 1.1093 6.9433 4.5186 0.8441 0.8081 5.1933 3.9939 0.0981 20.1960 0.1915 2.0919 62.4191 37.1171 7.8202 12.3383 1.3676 3.5568 3.5181 5.4950 10.8401 4.7105 33.1078 19.5132 24.5558 81.2260 56.3619 14.4584 0.4319 64.1809 9.1300 0.2436 0.1167 0.4527 3.5326 0.5876 0.0079 19.9530 11.6284 8.8040 10.4468 9.3035 14.3646 0.8095 7.2119 6.8191 203.9212 49.5125 86.1694 80.6319 185.1648 37.4015 20.5535 11.2721 2.0135 101.2398 16.8292 135.8560 21.5423 13.6637 27.7031 152.7604 12.9651 2.0276 23.6389 4.6636 29.7328 1.0151 20.7806 8.8435 10.6184 29.8056
temp: 298.150 k
press: 1.00000 atm
elementType: 16 8 8 7 7 6 6 6 6 6 6 6 6 6 6 6 6 1 1 1 1 1 1 1 1 1 1
symmnumber: 1
zpe: 515469.6 jmol-1
zpe.correction: 0.196332 hartree
zpe.thermalcorrener: 0.210954 hartree
zpe.thermalcorrenthalpy: 0.211898 hartree
zpe.thermalcorrgfe: 0.152647 hartree
zpe.sumelectzpe: -1119.990800 hartree
zpe.sumelectthermal: -1119.976178 hartree
zpe.sumelectthermalent: -1119.975234 hartree
zpe.sumelectthermalfe: -1120.034485 hartree
dipole: 2.1983 4.6884 -1.7462
dipole: 5.4647
quadrupole: -109.9045 -107.0943 -98.0139
quadrupole: -12.0872 -1.3428 1.7700
quadrupole: -4.9002 -2.0901 6.9903 -12.0872 -1.3428 1.7700
hfenergy: -1120.187132 hartree
pointgroup: C01 [X(C12H10N2O2S1)]
dipole: 0.3181729 -2.0292359 0.6351349 debye
polarizability: 257.1709296|-32.1241283|162.8993271|28.4489143|-4.8903789|122.6046563 unknown
InChI: InChI=1S/C12H10N2O2S/c15-14(16)11-8-4-5-9-12(11)17-13-10-6-2-1-3-7-10/h1-9,13H
charge 0 multiplicity 1
27 atoms
S  -0.079939 1.587534 0.823738
O  -4.076639 2.525463 -0.884209
O  -1.992446 3.020999 -0.09031
N  1.143518 0.473025 1.489347
N  -2.933452 2.172539 -0.404371
C  -1.392567 0.353443 0.357706
C  -2.643824 0.753236 -0.188339
C  2.246993 -0.041859 0.765412
C  -1.166026 -1.031895 0.537821
C  -3.644911 -0.187815 -0.536947
C  -2.153339 -1.973607 0.188988
C  -3.398721 -1.556031 -0.348209
C  3.309937 -0.656242 1.487234
C  2.310332 0.013481 -0.652616
C  4.406142 -1.212727 0.796613
C  3.417624 -0.542568 -1.328494
C  4.470851 -1.161165 -0.615879
H  -0.207345 -1.352895 0.955411
H  -4.586882 0.186744 -0.94704
H  1.178927 0.427549 2.509281
H  -1.949573 -3.039871 0.333879
H  -4.161899 -2.293102 -0.615512
H  3.275178 -0.694208 2.583661
H  1.504725 0.496806 -1.21513
H  5.215912 -1.682435 1.366707
H  3.454924 -0.489731 -2.422593
H  5.3257 -1.590262 -1.148451
