program: Gaussian 09
title: 000291726
version: EM64L-G09RevD.01
frameworkgroup: C1[X(C19H17NO5)]
method: RPBEPBE
basis: SDD
operation: Freq
keyword: #p
keyword: freq=noraman
keyword: PBEPBE/SDD
title: #p freq=noraman PBEPBE/SDD
converged: YES YES NO NO
title: Mulliken charges:
elementType: O O O O O N C C C C C C C C C C C C C C C C C C C H H H H H H H H H H H H H H H H H
charge: -0.262730 -0.249629 -0.239962 -0.302522 -0.299498 -0.009742 -0.233203 -0.567306 0.507155 0.133619 0.357639 -0.534270 -0.431638 0.192723 -0.446350 0.173143 -0.355618 0.228510 -0.325941 -0.344799 0.179040 -0.240418 -0.203343 -0.530089 -0.530516 0.296372 0.258931 0.268523 0.271349 0.271210 0.265254 0.283604 0.260606 0.251670 0.245628 0.245866 0.254444 0.231807 0.220360 0.229841 0.225372 0.254911
chargesum: 0.00000
title: Mulliken charges with hydrogens summed into heavy atoms:
elementType: O O O O O N C C C C C C C C C C C C C C C C C C C
charge: -0.262730 -0.249629 -0.239962 -0.302522 -0.299498 -0.009742 0.063169 -0.039852 0.507155 0.133619 0.357639 -0.262922 -0.160428 0.192723 -0.181097 0.173143 -0.072014 0.228510 -0.065335 -0.093129 0.179040 -0.240418 0.288152 0.176521 0.179608
polarizability: 2.83159763e+02 1.70040935e+01 1.97110348e+02 4.49031883e+00 1.80744033e+00 2.17627442e+02
1716.lowfreq: -4.0453 -0.0001 0.0003 0.0004 1.1325 6.4420 12.5382 17.6273 27.7924
frequency: 12.4957 17.5666 27.7797 31.9843 55.1349 68.6539 72.9149 90.4390 110.0066 112.9035 114.0553 143.1454 157.4598 162.5736 168.3185 174.2165 216.1644 218.1912 253.3237 271.3810 296.8846 311.3902 327.6699 341.4050 368.0299 380.8676 413.9579 430.6625 447.0653 457.8609 489.1547 502.8551 553.4844 565.0092 577.0661 578.8358 620.3099 647.0752 657.5155 682.4494 705.3563 723.7516 730.0765 750.4431 755.0079 782.3454 833.3563 836.1357 844.6546 859.5600 876.5018 883.9987 904.7111 936.8789 943.3374 958.5143 965.5630 974.3521 975.2973 989.9965 1007.0691 1051.3251 1064.2092 1067.1807 1094.5553 1113.7279 1114.3550 1120.3381 1136.1291 1139.5968 1154.1258 1154.9850 1178.0686 1194.4896 1206.6329 1235.9731 1240.5226 1249.9467 1265.6390 1268.1879 1301.8188 1334.5816 1363.5174 1368.9773 1386.0925 1404.9225 1425.0156 1432.0476 1443.4875 1449.5498 1457.5065 1459.8532 1476.1500 1477.2868 1483.9146 1487.6377 1488.5814 1565.6628 1573.4419 1600.8197 1612.5040 1626.1016 2191.9752 2972.2692 2974.6048 2981.9433 3000.4798 3022.8464 3056.5258 3069.1149 3071.2763 3104.4409 3122.2594 3122.4499 3143.4708 3148.6071 3164.3683 3168.6191 3182.4171 3187.9093
redmass: 6.1026 4.6655 3.1604 3.4735 5.3191 6.9908 5.1225 6.6429 7.3501 3.8592 3.1553 2.9971 2.8815 1.1233 1.5393 3.0303 4.5924 5.2836 5.2913 6.9856 7.6218 6.3594 4.7631 4.8085 7.4047 7.8356 2.9668 4.8330 5.8283 4.7406 3.6958 3.6296 5.7794 7.2432 5.7411 5.1939 3.6074 6.6554 4.1428 9.6790 6.1517 4.9153 4.4890 3.5760 5.5616 6.5355 8.3655 1.4183 1.4906 2.2825 2.1570 5.1087 1.5412 2.8804 7.6448 4.5789 1.4472 5.3541 1.4778 3.2323 2.8176 3.2054 1.4556 3.6390 2.9280 1.2433 1.2453 1.0368 1.6043 1.3043 1.3999 1.3492 1.3645 1.5380 1.7635 1.5398 2.7986 1.4729 2.5369 1.4932 2.0743 1.8841 1.3648 5.8842 4.2750 1.9713 1.1834 1.1514 1.4213 4.0688 1.0545 1.0717 1.8984 1.0734 2.5952 1.4896 1.0599 8.8719 7.4555 7.7233 6.5467 8.5361 12.5562 1.0310 1.0309 1.0636 1.0814 1.0535 1.0965 1.1033 1.1041 1.1193 1.1029 1.1028 1.0918 1.0883 1.0893 1.0971 1.0927 1.0966
irintensity: 0.1937 0.5434 6.0827 7.2067 0.0419 4.4599 1.8229 10.6662 2.7385 2.5387 7.2603 2.1071 1.9346 0.1514 0.3441 7.8542 6.7156 1.4612 13.3561 0.6183 0.4696 3.2776 1.7355 0.5874 1.7490 15.2025 3.5453 4.2974 5.9730 3.7801 9.2461 0.2467 1.4321 15.1354 12.3266 10.3855 4.1623 10.8410 39.8184 1.3121 8.9630 3.0021 4.0008 2.4483 11.2156 8.1736 29.9033 53.7472 29.5626 19.0725 25.3622 3.8161 13.1694 38.2323 44.6103 108.0594 6.0573 111.6207 4.0489 47.4606 0.1169 4.5381 4.3943 73.7375 66.8504 18.3004 1.2388 0.0004 8.0482 6.9728 0.4985 4.5220 15.8399 14.6955 11.4041 35.9302 119.6155 38.5358 419.1165 150.6104 60.4786 84.5758 12.5028 7.1264 10.7089 19.1667 0.7357 20.9321 19.0085 80.6963 18.4097 6.1715 79.9695 9.8036 132.9889 49.0782 28.9912 202.0116 8.8726 12.0657 4.7131 21.9804 19.6749 80.9252 64.9254 19.2653 16.6453 112.7046 9.0627 31.3215 21.8704 25.3657 20.6630 25.5640 0.9659 2.7836 0.2233 3.4259 1.7405 4.3556
temp: 298.150 k
press: 1.00000 atm
elementType: 8 8 8 8 8 7 6 6 6 6 6 6 6 6 6 6 6 6 6 6 6 6 6 6 6 1 1 1 1 1 1 1 1 1 1 1 1 1 1 1 1 1
symmnumber: 1
zpe: 833319.9 jmol-1
zpe.correction: 0.317395 hartree
zpe.thermalcorrener: 0.341164 hartree
zpe.thermalcorrenthalpy: 0.342108 hartree
zpe.thermalcorrgfe: 0.260330 hartree
zpe.sumelectzpe: -1163.218373 hartree
zpe.sumelectthermal: -1163.194604 hartree
zpe.sumelectthermalent: -1163.193660 hartree
zpe.sumelectthermalfe: -1163.275437 hartree
dipole: -3.7984 -5.0524 0.3101
dipole: 6.3285
quadrupole: -116.1558 -155.9477 -149.0444
quadrupole: -6.9832 12.1328 14.3907
quadrupole: 24.2269 -15.5651 -8.6618 -6.9832 12.1328 14.3907
hfenergy: -1163.5357676 hartree
pointgroup: C01 [X(C19H17N1O5)]
dipole: 1.7038538 1.8141564 -0.0709051 debye
polarizability: 286.2498002|6.541882|194.9080645|0.5064136|3.7737634|216.7396878 unknown
InChI: InChI=1S/C19H17NO5/c1-22-16-5-3-12(8-18(16)23-2)14(10-20)7-15(21)13-4-6-17-19(9-13)25-11-24-17/h3-6,8-9,14H,7,11H2,1-2H3
charge 0 multiplicity 1
42 atoms
O  5.154881 0.295707 -1.384169
O  6.212218 1.060202 0.633205
O  0.529741 -1.455879 2.290058
O  -3.941185 1.261748 -2.25595
O  -4.44346 2.663775 0.269723
N  -1.979378 -3.936216 -1.611513
C  -1.163022 -2.112039 0.15772
C  0.335384 -1.760729 -0.119909
C  -2.059371 -0.861422 0.163173
C  1.061436 -1.287076 1.150109
C  2.412957 -0.665812 1.014229
C  -2.616405 -0.355226 -1.035331
C  -2.285341 -0.168404 1.378354
C  4.32254 0.056302 -0.263829
C  3.060952 -0.530361 -0.256703
C  4.950614 0.507562 0.920274
C  3.057568 -0.211082 2.199441
C  -3.394623 0.820428 -1.028327
C  4.338846 0.386542 2.173717
C  -3.082073 0.996304 1.392966
C  -3.65719 1.48958 0.202899
C  -1.623086 -3.117949 -0.819327
C  6.381526 0.939518 -0.845551
C  -3.493505 2.606972 -2.687501
C  -5.862153 2.477997 -0.121201
H  -1.199522 -2.570225 1.166116
H  0.394143 -0.996006 -0.914837
H  0.871937 -2.65542 -0.496999
H  -2.466899 -0.863981 -1.994417
H  -1.840251 -0.543437 2.305335
H  2.602639 -0.872461 -1.187233
H  2.524499 -0.339261 3.146317
H  4.831576 0.737639 3.083285
H  -3.285173 1.532709 2.325262
H  6.479493 1.950552 -1.27505
H  7.251308 0.293429 -1.05144
H  -3.724551 3.367833 -1.920506
H  -4.044779 2.813101 -3.617438
H  -2.405521 2.597014 -2.889568
H  -6.313867 3.480116 -0.066516
H  -6.364731 1.79829 0.592433
H  -5.94107 2.070361 -1.145004
