program: Gaussian 09
title: 000291715
version: EM64L-G09RevD.01
frameworkgroup: C1[X(C13H12N2O3S)]
method: RPBEPBE
basis: SDD
operation: Freq
keyword: #p
keyword: freq=noraman
keyword: PBEPBE/SDD
title: #p freq=noraman PBEPBE/SDD
converged: YES YES NO NO
title: Mulliken charges:
elementType: S O O O N N C C C C C C C C C C C C C H H H H H H H H H H H H
charge: 0.230704 -0.258081 -0.187309 -0.178419 -0.003572 -0.691056 -0.368667 0.439344 -0.353258 -0.120810 -0.472686 0.363953 0.463284 -0.363734 -0.188255 -0.389874 -0.268898 -0.196541 -0.535611 0.256456 0.295788 0.251550 0.283301 0.217566 0.230473 0.222542 0.302607 0.314022 0.226199 0.225463 0.253518
chargesum: 0.00000
title: Mulliken charges with hydrogens summed into heavy atoms:
elementType: S O O O N N C C C C C C C C C C C C C
charge: 0.230704 -0.258081 -0.187309 -0.178419 -0.003572 -0.074426 -0.368667 0.439344 -0.353258 0.135645 -0.176898 0.363953 0.463284 -0.112183 0.095046 -0.172308 -0.038426 0.026001 0.169569
polarizability: 2.46259405e+02 -6.30302628e+00 1.87081008e+02 8.41428393e+00 1.23437283e+01 1.39914354e+02
1716.lowfreq: -7.4117 -4.1150 -0.0024 -0.0022 -0.0021 5.5634 27.1838 35.6036 43.3961
frequency: 26.8600 35.5790 43.3655 61.2723 83.2546 101.3240 142.6438 145.8911 171.0889 177.4912 224.6052 251.2087 261.4658 291.1557 303.0338 354.2895 358.4743 375.0699 384.5514 412.9282 440.8659 449.4666 480.9375 515.2685 523.1268 547.9502 548.8724 584.2012 624.7488 654.8252 659.1021 688.6850 724.4229 736.3355 741.2948 757.8230 819.4901 826.4863 848.4175 863.6308 894.1235 948.1906 952.0984 976.9077 996.4779 999.9698 1014.2202 1032.6231 1043.2400 1106.9414 1112.7432 1136.6491 1138.0126 1167.6939 1170.9928 1215.9496 1232.2681 1261.8903 1270.2147 1318.3574 1355.3221 1377.4969 1381.3697 1413.9894 1433.9426 1440.5821 1464.8758 1469.3458 1472.7988 1480.9332 1561.1184 1572.2311 1598.4033 1607.6394 1623.4479 2966.2135 3057.3571 3117.6082 3134.3593 3139.1987 3150.0225 3156.4776 3173.2055 3174.4282 3184.8131 3520.8376 3680.7922
redmass: 5.3833 5.4950 6.2273 11.0914 3.7493 4.7806 8.6085 4.5710 5.8673 4.9778 1.2003 4.9678 4.3481 5.8130 5.4827 7.3952 6.8766 6.0216 1.1615 4.5438 3.3641 3.7460 4.8853 1.9129 1.6401 5.8059 3.4432 5.5220 5.3844 7.1071 7.0000 5.6928 3.3912 5.3070 5.9806 1.3614 1.4230 5.1096 1.4548 7.2820 1.6360 1.3582 1.3576 1.3168 4.2276 4.0353 4.7835 2.4120 1.9616 2.0909 1.2590 1.3801 1.4418 1.3174 1.0551 3.6858 5.5118 1.6663 1.6706 1.8898 4.5036 11.8669 7.7195 4.9004 1.2419 2.5235 1.8242 1.0656 1.2298 2.8929 7.9090 6.3134 1.7396 6.6409 2.3451 1.0329 1.1044 1.0867 1.0997 1.0912 1.0891 1.0931 1.0955 1.0988 1.0928 1.0467 1.1015
irintensity: 0.7914 0.6880 1.6156 0.6746 2.2168 0.6377 2.5880 1.0126 3.0776 0.3235 0.2065 7.4879 3.5917 10.0515 5.8060 1.5485 1.8929 1.3076 153.5628 3.4613 19.8149 2.9127 14.8638 51.5499 54.5226 1.1505 7.7747 11.6144 5.6037 7.4386 3.5609 0.7746 0.9127 16.0276 8.5934 94.6458 34.6758 3.2002 1.9548 9.4761 30.0866 0.7473 3.8519 0.1850 23.3525 34.6811 17.4599 2.6364 22.2530 4.9460 0.1588 11.5593 0.7232 0.0757 8.7061 114.7010 245.3187 97.1442 16.7999 18.0417 2.0170 171.0068 5.4279 6.9291 44.0734 6.7734 176.7020 20.5915 2.2118 72.2151 17.7795 4.7808 18.3905 78.8766 249.7087 57.5419 41.1925 10.2508 20.6188 23.5515 1.5021 11.9354 8.5862 19.3631 3.6486 45.7275 40.1566
temp: 298.150 k
press: 1.00000 atm
elementType: 16 8 8 8 7 7 6 6 6 6 6 6 6 6 6 6 6 6 6 1 1 1 1 1 1 1 1 1 1 1 1
symmnumber: 1
zpe: 597773.2 jmol-1
zpe.correction: 0.227680 hartree
zpe.thermalcorrener: 0.245494 hartree
zpe.thermalcorrenthalpy: 0.246439 hartree
zpe.thermalcorrgfe: 0.180511 hartree
zpe.sumelectzpe: -1234.352294 hartree
zpe.sumelectthermal: -1234.334479 hartree
zpe.sumelectthermalent: -1234.333535 hartree
zpe.sumelectthermalfe: -1234.399463 hartree
dipole: -0.6324 -8.1043 -0.4364
dipole: 8.1407
quadrupole: -103.9969 -115.7670 -112.7621
quadrupole: 7.5105 -3.7980 5.8761
quadrupole: 6.8451 -4.9250 -1.9201 7.5105 -3.7980 5.8761
hfenergy: -1234.5799738 hartree
pointgroup: C01 [X(C13H12N2O3S1)]
dipole: 0.1032292 -3.0411357 -0.9993338 debye
polarizability: 247.0565606|-1.0576886|176.620268|5.7971557|23.1316025|149.5779381 unknown
InChI: InChI=1S/C13H12N2O3S/c1-18-9-6-7-13(11(8-9)15(16)17)19-12-5-3-2-4-10(12)14/h2-8H,14H2,1H3
charge 0 multiplicity 1
31 atoms
S  0.971697 1.211397 -1.195402
O  -4.118299 -1.787358 0.306286
O  -2.573809 2.996309 0.45898
O  -0.448903 2.629312 1.198207
N  -1.524844 2.257591 0.595963
N  3.023736 -0.930938 -2.041782
C  -0.520352 0.268224 -0.640344
C  -1.594902 0.866257 0.070058
C  2.279929 0.430423 -0.129261
C  -0.674872 -1.083254 -1.020208
C  -2.787372 0.175432 0.351111
C  -2.908208 -1.17983 -0.032128
C  3.158736 -0.536406 -0.711377
C  -1.838615 -1.818758 -0.71093
C  2.41446 0.825969 1.217161
C  4.176895 -1.09279 0.120246
C  3.423243 0.259706 2.027825
C  4.300295 -0.700252 1.466458
C  -4.304358 -3.193721 -0.069479
H  0.138598 -1.567098 -1.570269
H  -3.610069 0.672775 0.87089
H  -1.90415 -2.867498 -1.013311
H  1.722195 1.573504 1.616131
H  4.865475 -1.834618 -0.302915
H  3.525078 0.566272 3.073369
H  5.0915 -1.143994 2.081983
H  3.709664 -1.547388 -2.467613
H  2.355232 -0.439969 -2.634668
H  -3.554286 -3.842242 0.422534
H  -4.252952 -3.324203 -1.167457
H  -5.310841 -3.452052 0.288845
