program: Gaussian 09
title: 000291711
version: EM64L-G09RevD.01
frameworkgroup: C1[X(C12H12N2O2S)]
method: RPBEPBE
basis: SDD
operation: Freq
keyword: #p
keyword: freq=noraman
keyword: PBEPBE/SDD
title: #p freq=noraman PBEPBE/SDD
converged: YES YES NO NO
title: Mulliken charges:
elementType: S O O N N C C C C C C C C C C C C H H H H H H H H H H H H
charge: 0.937997 -0.553027 -0.510968 -0.521394 -0.695518 -0.262479 0.460615 0.354822 -0.216073 -0.362171 -0.257150 -0.191195 -0.317383 -0.364932 -0.210037 -0.196659 -0.239092 0.282353 0.284236 0.228440 0.240561 0.284442 0.225774 0.230601 0.233417 0.229092 0.308246 0.365373 0.232111
chargesum: 0.00000
title: Mulliken charges with hydrogens summed into heavy atoms:
elementType: S O O N N C C C C C C C C C C C C
charge: 0.937997 -0.553027 -0.510968 -0.239041 -0.021899 -0.262479 0.460615 0.354822 0.068163 -0.133731 -0.016589 0.039406 -0.032941 -0.139159 0.023380 0.032433 -0.006981
polarizability: 2.21066292e+02 1.46330634e+01 1.80753640e+02 2.50594689e+01 1.67096276e+00 1.50947512e+02
1716.lowfreq: -15.0708 -9.5346 -1.7200 0.0003 0.0010 0.0012 9.5476 28.4458 30.5853
frequency: 8.7977 28.4066 30.3623 89.7399 94.3528 148.3343 180.7488 185.8060 210.4377 239.5476 266.3641 283.6768 311.3079 372.0561 398.0842 411.4782 417.5439 450.6189 465.6596 477.7525 504.3658 532.2479 541.5489 561.7283 611.2469 642.0569 689.1038 701.7534 721.6421 757.9255 764.3752 783.4807 808.6742 821.8481 827.1676 839.1692 846.7038 911.8900 939.1057 951.6140 970.9358 979.6150 981.5076 984.3487 993.2675 1021.2989 1029.5813 1062.4320 1078.2202 1150.3341 1172.0601 1173.9261 1181.3516 1225.1640 1231.5705 1274.4237 1330.9904 1332.5396 1387.2702 1388.5463 1444.0546 1446.1755 1471.8560 1483.7768 1560.3331 1580.9150 1598.7420 1613.0283 1639.7693 3119.2264 3125.9181 3134.2430 3146.3577 3146.5739 3152.9475 3164.1336 3176.5405 3180.4178 3359.0394 3367.1598 3637.1350
redmass: 5.0047 4.5592 4.9344 5.3850 5.6821 4.6358 7.1069 9.0031 8.9745 5.0607 9.9129 5.7212 6.2862 8.2900 2.9065 3.3143 3.5418 3.1064 1.6499 2.4364 3.6777 4.6160 4.6025 5.5467 6.2096 6.9076 1.8225 1.6248 1.7344 1.2942 1.7519 5.2063 2.5885 2.8313 4.4704 1.3194 1.4318 1.5302 6.2344 1.3722 1.3894 2.9455 1.8155 6.1417 1.3295 2.1453 2.0020 1.6970 1.5715 1.2408 1.0581 1.0564 1.1455 1.2400 3.3821 1.7154 1.5616 1.4305 5.9244 6.7298 2.5267 2.2419 2.2158 3.2618 5.8476 5.8907 5.9136 2.4859 1.6328 1.0876 1.0871 1.0874 1.0903 1.0933 1.0934 1.0981 1.0997 1.0976 1.0604 1.0754 1.0905
irintensity: 0.5650 0.3153 0.0688 4.3392 0.0313 1.0503 7.2647 2.7405 0.5876 3.5036 2.5793 18.4483 0.5095 18.3349 8.0237 4.4805 32.2180 59.6355 142.0494 54.0015 7.1018 1.7166 6.9410 1.1882 1.8234 1.5875 35.1413 83.2428 108.2443 85.0469 64.5797 33.0018 115.7744 4.6959 31.3987 17.4737 6.6253 7.2309 45.1248 3.3673 0.1364 6.3524 2.5209 0.0754 0.3044 4.2113 4.3384 3.4112 12.8521 8.3995 0.0103 11.5131 1.7385 0.6805 3.6295 19.8606 4.9958 12.5100 24.8287 6.4099 5.6184 9.6021 24.2206 78.6449 15.2114 1.9119 1.1897 5.0441 315.7469 6.1606 7.2972 0.6754 11.0710 31.3542 3.1366 25.5027 15.8265 5.6047 118.4287 13.4973 60.8966
temp: 298.150 k
press: 1.00000 atm
elementType: 16 8 8 7 7 6 6 6 6 6 6 6 6 6 6 6 6 1 1 1 1 1 1 1 1 1 1 1 1
symmnumber: 1
zpe: 570178.8 jmol-1
zpe.correction: 0.217170 hartree
zpe.thermalcorrener: 0.233055 hartree
zpe.thermalcorrenthalpy: 0.233999 hartree
zpe.thermalcorrgfe: 0.171393 hartree
zpe.sumelectzpe: -1121.103467 hartree
zpe.sumelectthermal: -1121.087582 hartree
zpe.sumelectthermalent: -1121.086637 hartree
zpe.sumelectthermalfe: -1121.149244 hartree
dipole: -0.8774 5.8877 -3.1698
dipole: 6.7441
quadrupole: -93.8901 -114.5295 -101.0038
quadrupole: -2.0706 10.8007 3.7709
quadrupole: 9.2510 -11.3884 2.1374 -2.0706 10.8007 3.7709
hfenergy: -1121.3206367 hartree
pointgroup: C01 [X(C12H12N2O2S1)]
dipole: -0.2369882 -2.3615416 1.1862473 debye
polarizability: 214.8752281|-13.4862101|180.7347762|-32.2466554|4.4041689|157.1574396 unknown
InChI: InChI=1S/C12H12N2O2S/c13-11-8-4-5-9-12(11)17(15,16)14-10-6-2-1-3-7-10/h1-9,14H,13H2
charge 0 multiplicity 1
29 atoms
S  -0.657321 1.75463 -0.239659
O  -1.557268 2.840051 0.598044
O  -0.14351 2.048678 -1.74736
N  0.969835 1.622637 0.857386
N  -2.67199 0.627584 1.908358
C  -1.540955 0.096692 -0.224538
C  -2.393557 -0.247062 0.870202
C  1.894636 0.617258 0.461922
C  -1.259316 -0.76848 -1.299099
C  -2.947671 -1.566582 0.831226
C  -1.830953 -2.055721 -1.308799
C  -2.665837 -2.444275 -0.229231
C  2.619705 0.80403 -0.749855
C  2.143381 -0.533812 1.263883
C  3.581263 -0.148262 -1.141159
C  3.135271 -1.459988 0.880024
C  3.850537 -1.276626 -0.327472
H  0.589783 1.497399 1.815331
H  -0.613172 -0.419491 -2.111714
H  -3.612494 -1.87959 1.64512
H  -1.629438 -2.741342 -2.136412
H  2.422674 1.695843 -1.351428
H  1.569332 -0.688217 2.186557
H  -3.113265 -3.44454 -0.223405
H  4.136626 -0.001731 -2.07394
H  3.338973 -2.331088 1.512438
H  -3.314314 0.337819 2.641911
H  -2.462163 1.62808 1.780634
H  4.612007 -2.003695 -0.629764
