program: Gaussian 09
title: 000291730
version: EM64L-G09RevD.01
frameworkgroup: C1[X(C14H20N6O4)]
method: RPBEPBE
basis: SDD
operation: Freq
keyword: #p
keyword: freq=noraman
keyword: PBEPBE/SDD
title: #p freq=noraman PBEPBE/SDD
converged: YES YES NO NO
title: Mulliken charges:
elementType: O O O O N N N N N N C C C C C C C C C C C C C C H H H H H H H H H H H H H H H H H H H H
charge: -0.252422 -0.420913 -0.436387 -0.254970 -0.162118 -0.076162 -0.077489 -0.612440 -0.121698 -0.107644 -0.124197 -0.147551 -0.021743 -0.138069 -0.614818 -0.427362 0.162901 0.244011 -0.223117 -0.095610 0.241661 -0.377199 -0.618479 -0.652050 0.233521 0.320464 0.254931 0.230189 0.280292 0.235474 0.223761 0.220032 0.325656 0.269683 0.344994 0.318344 0.331871 0.239326 0.258279 0.218573 0.256774 0.226449 0.296773 0.228479
chargesum: 0.00000
title: Mulliken charges with hydrogens summed into heavy atoms:
elementType: O O O O N N N N N N C C C C C C C C C C C C C C
charge: -0.252422 -0.095257 -0.091393 -0.254970 -0.162118 -0.076162 -0.077489 0.037774 -0.121698 -0.107644 0.109324 0.172914 0.233188 0.092120 -0.099052 0.016432 0.162901 0.244011 0.046565 -0.095610 0.241661 -0.137873 0.115147 0.099651
polarizability: 2.85004134e+02 1.20621861e+01 1.84579183e+02 -3.94179999e+00 2.36275064e+01 1.58919911e+02
1716.lowfreq: -67.9675 -8.2469 -0.0009 -0.0009 -0.0003 2.0167 5.6450 21.0282 28.5854
frequency: -67.9545 20.9926 28.5547 33.9853 42.5754 55.5916 64.9807 83.3145 93.9289 107.6085 113.9295 122.8453 149.0185 167.6247 180.6584 214.2772 228.5298 242.3721 262.1210 286.8239 298.5689 302.6463 314.9784 340.8967 360.3161 363.9099 386.2358 403.2683 444.9311 469.9329 487.4946 504.7687 509.7429 535.2065 546.3837 562.6483 569.1377 611.6249 613.1712 643.9226 667.7540 672.5637 710.6940 722.6922 785.9312 793.8520 816.3157 838.8147 846.5744 856.9414 893.0909 902.0181 921.2216 927.8234 956.7503 962.8670 982.4068 1002.6983 1012.5763 1026.2392 1052.6002 1061.0752 1072.5351 1085.2542 1094.3698 1096.6671 1134.5829 1137.1567 1144.9089 1148.0287 1153.7543 1185.5920 1187.5334 1227.7930 1238.7666 1253.1406 1256.4031 1266.0953 1279.3618 1288.5655 1299.1536 1313.0612 1326.3774 1333.4254 1342.0443 1347.6973 1355.4598 1358.1633 1370.5467 1379.5986 1389.3389 1405.6510 1410.1416 1429.6635 1446.2802 1458.1685 1465.7588 1468.7152 1474.3978 1474.8673 1493.1706 1494.0341 1529.9997 1592.7617 1595.4450 1643.4798 2963.1409 2969.9199 2987.6929 2992.0939 2997.7693 3006.6726 3046.0284 3059.6952 3080.9061 3084.6664 3085.6208 3097.7628 3112.1146 3124.8866 3153.4049 3227.7619 3514.0215 3532.5413 3567.7343 3671.2972
redmass: 1.1303 5.6431 4.8287 5.7912 5.6184 5.4112 5.2000 2.6260 4.9751 3.5861 4.6211 5.5612 1.2787 3.9895 4.8227 4.2669 3.0366 5.9492 5.0208 4.0894 1.4506 3.2494 1.1484 3.7153 3.2206 5.2935 4.0781 2.7979 2.9219 4.2150 2.5867 4.5103 1.2387 3.1396 4.7977 3.2312 4.2750 4.3743 1.7139 5.2514 8.1887 7.7071 6.2471 4.1616 3.8301 6.2376 2.0053 7.8820 3.0478 2.9548 5.2473 2.4890 2.6360 1.4338 5.9913 4.5463 2.6807 4.0515 3.1767 2.6801 1.9686 1.4923 2.0385 2.8701 1.2311 6.2402 2.1064 1.3557 2.0999 1.5559 1.6308 2.4217 2.0816 1.5369 1.3562 2.4829 1.3349 1.6376 2.5247 3.4359 1.2733 1.4127 1.3099 1.5020 6.4480 2.4690 2.4156 1.4110 1.2904 1.3296 1.5098 1.8028 1.5081 1.9835 1.7503 1.2914 1.0408 1.0840 1.0770 1.0837 1.0580 2.1761 7.2943 1.5888 4.0249 3.5878 1.0828 1.0359 1.0847 1.0647 1.0339 1.0603 1.1019 1.0868 1.1030 1.1011 1.1012 1.0883 1.1023 1.0973 1.0917 1.0982 1.0445 1.0660 1.0664 1.1045
irintensity: 0.3432 3.8912 6.9639 1.5184 3.4199 1.6918 7.9151 0.0466 2.3385 4.1862 1.4684 1.9888 0.5493 1.4503 5.8410 0.6727 5.7390 1.4803 5.9562 18.5133 84.8213 37.4756 146.2660 64.5387 7.3011 12.3792 16.4461 6.6469 10.1333 3.8186 11.7218 0.4699 156.4043 30.0230 1.5356 15.7037 4.9252 7.9359 72.0295 22.8157 2.6358 3.2132 10.0900 36.6226 22.5060 121.3320 9.9445 15.7228 7.8220 2.6390 0.6247 7.0874 14.2515 12.3767 54.5523 113.3630 45.3243 12.7230 108.7258 56.2322 40.6837 19.6053 1.0766 31.6116 0.0753 0.2130 19.7724 0.2161 8.2770 41.8589 40.3990 117.2251 53.1739 19.5658 15.3244 7.5596 19.1635 44.3720 8.7574 17.1575 12.1744 1.5358 75.6928 28.3639 79.1298 142.9024 126.3987 13.7078 2.7993 13.6810 13.5807 10.2643 27.1694 23.8895 5.6450 19.0956 17.3928 7.7258 6.5916 18.8962 12.0895 47.7760 51.1271 242.6709 514.7851 264.3618 28.2320 97.0781 16.7624 46.7486 52.2737 27.7322 34.8040 15.6784 2.6750 17.6383 24.8563 7.3260 25.0324 0.4397 18.4065 0.0672 32.4031 5.2116 9.3474 22.1243
temp: 298.150 k
press: 1.00000 atm
elementType: 8 8 8 8 7 7 7 7 7 7 6 6 6 6 6 6 6 6 6 6 6 6 6 6 1 1 1 1 1 1 1 1 1 1 1 1 1 1 1 1 1 1 1 1
symmnumber: 1
zpe: 914584.9 jmol-1
zpe.correction: 0.348347 hartree
zpe.thermalcorrener: 0.371479 hartree
zpe.thermalcorrenthalpy: 0.372423 hartree
zpe.thermalcorrgfe: 0.293915 hartree
zpe.sumelectzpe: -1173.073292 hartree
zpe.sumelectthermal: -1173.050160 hartree
zpe.sumelectthermalent: -1173.049216 hartree
zpe.sumelectthermalfe: -1173.127724 hartree
dipole: -0.5449 -1.8997 2.7400
dipole: 3.3784
quadrupole: -103.8967 -144.1538 -146.6149
quadrupole: 1.2308 -1.3720 10.2326
quadrupole: 27.6585 -12.5987 -15.0598 1.2308 -1.3720 10.2326
hfenergy: -1173.4216391 hartree
pointgroup: C01 [X(C14H20N6O4)]
dipole: -0.0738665 1.176067 0.6148486 debye
polarizability: 281.7127339|-20.01761|156.4873648|-15.2161376|-18.1775093|190.3031289 unknown
InChI: InChI=1S/C14H20N6O4/c1-19(2)12-10-13(17-5-16-12)20(6-18-10)14-11(23)7(3-9(15)22)8(4-21)24-14/h5-8,11,14,21,23H,3-4,15H2,1-2H3
charge 0 multiplicity 1
44 atoms
O  -1.39291 0.858709 2.186642
O  -2.890391 -2.066007 1.297269
O  -3.622681 3.295484 0.413153
O  -3.049844 -1.796704 -2.225897
N  0.403314 -0.629797 1.468967
N  2.621534 -1.172042 1.71228
N  0.478884 0.432464 -0.776526
N  -5.033205 -0.607635 -2.029853
N  4.64364 -0.465097 -0.642619
N  2.738822 0.426597 -1.726199
C  -2.818133 0.268303 0.328572
C  -2.027685 -1.008155 0.761412
C  -2.066135 1.451277 0.988988
C  -1.016793 -0.514878 1.851072
C  -2.954814 0.439401 -1.2059
C  -2.949844 2.58845 1.517551
C  1.041593 -0.195972 0.298849
C  -3.661247 -0.747965 -1.866212
C  1.407038 -1.19584 2.275565
C  2.417301 -0.543746 0.460604
C  3.296262 -0.204508 -0.626758
C  1.408614 0.700627 -1.743064
C  5.311947 -1.142435 0.48734
C  5.473455 -0.094026 -1.802943
H  -3.831329 0.208713 0.779876
H  -1.52015 -1.483933 -0.090596
H  -1.287696 1.834797 0.298308
H  -1.129203 -1.114694 2.770343
H  -1.938153 0.504775 -1.630306
H  -3.492215 1.384018 -1.406205
H  -2.341504 3.281092 2.132907
H  -3.766406 2.186762 2.139975
H  -3.539364 -1.662898 1.930711
H  1.182786 -1.611471 3.255925
H  -2.953988 3.838488 -0.075662
H  -5.525462 0.242572 -1.761248
H  -5.557311 -1.382078 -2.43724
H  1.037318 1.196998 -2.645247
H  5.18283 -0.57937 1.427063
H  6.385845 -1.223842 0.254954
H  4.897488 -2.151661 0.654341
H  6.2730 0.606489 -1.495273
H  4.829814 0.389007 -2.551698
H  5.941475 -0.994366 -2.244617
