program: Gaussian 09
title: 000291950
version: EM64L-G09RevD.01
frameworkgroup: C1[X(C23H27Cl2N7O)]
method: RPBEPBE
basis: SDD
operation: Freq
keyword: #p
keyword: freq=noraman
keyword: PBEPBE/SDD
title: #p freq=noraman PBEPBE/SDD
converged: YES YES NO NO
title: Mulliken charges:
elementType: Cl Cl O N N N N N N N C C C C C C C C C C C C C C C C C C C C C C C H H H H H H H H H H H H H H H H H H H H H H H H H H H
charge: -0.059152 -0.049824 -0.438025 -0.162659 -0.491367 -0.266249 0.005408 -0.109370 -0.459757 -0.643972 -0.486860 0.366960 -0.289542 -0.307388 -0.509774 0.088763 -0.712823 -0.712858 0.486685 -0.372171 -0.463599 0.294329 -0.535863 0.246953 -0.163152 -0.772704 0.519078 0.192963 -0.454057 -0.332390 -0.051983 -0.027447 -0.286339 0.222942 0.232798 0.231985 0.190886 0.230878 0.186497 0.290652 0.218406 0.225722 0.216447 0.225568 0.226033 0.224921 0.218567 0.230357 0.305709 0.356227 0.229671 0.247051 0.211002 0.246943 0.349180 0.268863 0.294228 0.284833 0.381402 0.410416
chargesum: 0.00000
title: Mulliken charges with hydrogens summed into heavy atoms:
elementType: Cl Cl O N N N N N N N C C C C C C C C C C C C C C C C C C C C C C C
charge: -0.059152 -0.049824 -0.081798 -0.162659 -0.185658 -0.266249 0.005408 -0.109370 -0.110577 0.147845 -0.031120 0.366960 0.133330 0.109988 -0.219122 0.088763 -0.052249 -0.036336 0.486685 -0.153603 -0.233242 0.294329 -0.306191 0.246953 -0.163152 -0.067708 0.519078 0.192963 -0.185194 -0.038161 -0.051983 -0.027447 -0.001506
polarizability: 5.07809747e+02 3.23654718e+01 4.22106865e+02 2.78436356e+01 -1.99433285e+01 1.97345031e+02
1716.lowfreq: -5.0554 -2.7479 -2.3846 -0.0015 -0.0010 -0.0006 8.7707 20.4417 31.6151
frequency: 8.3677 20.4251 31.6089 42.6437 45.4526 52.5879 54.2204 63.3405 71.8120 86.9118 94.3779 105.2456 115.6452 119.4487 131.2422 142.0551 145.1103 156.7620 176.2753 200.2956 202.2316 205.1181 216.0969 222.8218 226.5235 237.4572 245.6576 251.9840 262.6294 270.4629 287.4654 290.0288 314.5628 329.8745 330.8008 360.7886 372.8913 374.0898 407.8079 414.5027 429.2100 441.8254 458.6659 474.3955 496.8417 514.1407 526.5726 535.7914 545.4689 550.1543 556.1281 572.5055 592.9115 614.9743 630.0329 662.4414 674.7953 676.2876 692.2880 698.0314 703.1956 729.0640 745.3000 754.7324 757.0014 768.4525 777.0509 785.8381 792.7946 798.0638 806.6961 822.5509 833.9850 858.9821 878.4625 886.8512 893.0622 904.1893 910.1979 915.6269 940.7252 955.8814 958.4527 973.5799 979.8557 991.9439 999.0606 1014.7652 1045.2927 1052.2761 1055.7367 1072.2107 1082.0063 1090.9976 1095.8993 1101.0755 1108.2833 1115.3175 1150.1834 1160.6986 1164.8208 1177.3107 1191.9775 1220.8068 1233.4358 1245.3130 1248.7150 1266.2519 1274.1526 1280.2784 1285.7555 1291.8858 1313.3849 1335.0598 1358.9397 1364.5399 1372.1958 1377.2901 1380.6574 1393.4194 1394.0127 1396.3943 1406.8866 1417.5112 1424.6600 1447.1956 1451.4018 1458.1561 1466.1621 1470.0404 1470.7392 1472.2336 1476.8113 1479.5816 1484.3115 1488.3840 1494.2187 1503.4900 1515.4467 1537.7439 1546.5359 1564.4221 1570.6016 1608.3719 1610.3834 1625.4750 1660.8291 2871.8507 2895.3192 2937.4743 2985.7621 2988.2436 2991.4740 3046.0309 3048.9795 3052.1749 3074.9134 3080.4771 3082.9364 3087.2607 3096.9023 3100.4527 3111.8928 3134.6915 3136.3240 3147.8151 3162.2090 3192.6248 3194.8301 3196.5911 3308.0015 3506.8905 3545.1550 3583.2780
redmass: 12.3835 5.6064 5.0901 5.9189 4.9428 5.2230 3.8008 3.9522 1.0696 2.8455 4.9928 3.7053 2.6208 3.2446 5.1667 5.9978 8.8728 6.3448 4.3872 3.8232 2.7081 4.5615 2.6570 4.2269 3.8408 1.9119 5.0368 4.5231 1.7360 3.7028 2.7430 4.7886 2.7523 1.1955 3.4380 2.7934 11.9034 4.0052 8.6419 4.1046 2.9640 3.6736 3.8086 3.1997 3.2087 5.2267 6.7025 6.8345 2.0243 2.5677 4.3754 3.8839 2.8751 2.1418 4.7638 2.2982 3.9642 5.0741 2.3640 2.4273 4.0509 4.9791 2.8857 6.8014 3.5090 3.9335 4.1371 2.0456 1.4119 1.2842 1.2407 1.7276 1.4168 1.6548 1.4470 2.4038 1.7608 2.1328 1.3609 5.6632 4.6838 2.3573 2.5725 5.1615 1.3937 2.5905 1.7990 2.2479 1.5993 2.7248 2.5761 1.9495 2.1388 2.2050 1.5686 2.1401 1.8695 2.0437 1.8818 1.6265 1.2351 2.1867 1.9020 1.5305 4.4520 1.7311 1.4976 2.6145 1.7955 1.1500 2.2138 1.1385 1.9339 3.0999 1.3216 1.3091 2.1180 2.0345 4.9220 1.2899 1.2245 1.2265 4.3870 3.7426 4.4382 3.0981 1.0459 3.0260 1.0787 1.0949 1.1579 1.2232 1.2389 1.0492 2.0978 1.0631 1.0999 3.4040 3.4742 2.5279 3.3324 4.3883 3.3500 7.0768 4.9487 6.2194 1.6960 1.0717 1.0712 1.0678 1.0366 1.0361 1.0361 1.0893 1.0912 1.0887 1.0983 1.0972 1.0984 1.0996 1.0987 1.1008 1.0871 1.0578 1.0955 1.0925 1.0929 1.0926 1.0919 1.0941 1.1015 1.0751 1.0757 1.0661
irintensity: 0.1101 0.2204 0.4393 0.7523 0.1149 2.5372 0.2575 0.4021 0.3126 0.3703 6.8274 0.5569 0.1214 0.6053 1.9422 0.9937 0.2436 1.4937 0.7377 0.5695 1.5048 2.6681 0.2089 2.7342 0.9460 4.1371 1.1129 3.4135 5.0652 5.2165 2.7765 2.7443 9.1753 96.4180 14.6399 7.2743 5.8307 3.2570 7.8639 1.2830 1.5939 8.9440 7.7238 1.0604 12.0631 0.7266 6.0272 27.1472 49.2357 16.3172 6.2493 3.4692 27.8910 24.2539 7.3201 68.6671 10.6662 11.0970 52.6744 37.6981 4.3699 28.2490 8.1541 67.7243 17.4273 19.6423 2.2132 31.3576 32.4533 16.2557 2.0877 42.9565 24.8370 36.5663 54.0575 74.1568 64.5174 5.6553 2.6155 5.6955 56.9878 3.9101 21.5276 24.5036 25.3632 14.0238 2.8802 12.3604 12.9803 93.5102 60.7113 10.5686 115.7277 19.8922 15.4001 11.3169 32.5541 20.3517 37.2488 7.0967 52.8988 16.9480 69.0870 4.8417 39.4835 68.4188 3.3190 44.0073 19.2104 1.9100 58.8428 5.5987 172.8832 18.1988 2.0634 1.5807 29.3440 20.6229 165.4130 49.0690 12.9392 22.4778 383.2166 268.0766 745.7291 363.0977 13.2842 754.8974 42.2917 19.8397 74.5759 147.6669 6.7021 10.1355 58.4550 27.1110 27.5457 84.5658 264.0023 147.6495 242.8859 224.5027 488.3771 305.4015 29.8185 11.1001 672.1174 87.4397 96.5996 53.8232 20.9472 16.7973 24.9861 7.6917 9.2055 8.3612 43.9463 11.2092 33.9631 49.1689 29.7770 24.5832 19.9326 370.3477 3.0038 4.3998 1.0986 2.7555 0.9112 4.6297 421.5683 47.8229 22.7985 44.2492
temp: 298.150 k
press: 1.00000 atm
elementType: 17 17 8 7 7 7 7 7 7 7 6 6 6 6 6 6 6 6 6 6 6 6 6 6 6 6 6 6 6 6 6 6 6 1 1 1 1 1 1 1 1 1 1 1 1 1 1 1 1 1 1 1 1 1 1 1 1 1 1 1
symmnumber: 1
zpe: 1238590.6 jmol-1
zpe.correction: 0.471754 hartree
zpe.thermalcorrener: 0.504635 hartree
zpe.thermalcorrenthalpy: 0.505579 hartree
zpe.thermalcorrgfe: 0.405346 hartree
zpe.sumelectzpe: -2268.858894 hartree
zpe.sumelectthermal: -2268.826014 hartree
zpe.sumelectthermalent: -2268.825069 hartree
zpe.sumelectthermalfe: -2268.925303 hartree
dipole: 5.4400 -5.2304 -0.6900
dipole: 7.5780
quadrupole: -178.9572 -205.1522 -214.8059
quadrupole: -8.3982 4.9600 -4.6006
quadrupole: 20.6813 -5.5138 -15.1675 -8.3982 4.9600 -4.6006
hfenergy: -2269.3306484 hartree
pointgroup: C01 [X(C23H27Cl2N7O1)]
dipole: -2.8460595 0.8814163 0.1095031 debye
polarizability: 457.2902449|62.0714943|458.326965|-46.8124222|41.0559036|211.6444325 unknown
InChI: InChI=1S/C23H27Cl2N7O/c1-4-32(5-2)13-15-9-18(6-7-20(15)33)28-21-8-14(3)27-23(30-21)31-22(26)29-19-11-16(24)10-17(25)12-19/h6-12,28-29,33H,4-5,13,26H2,1-3H3
charge 0 multiplicity 1
60 atoms
Cl 3.634548 3.571065 2.280592
Cl 6.995816 1.651504 -1.687837
O  -4.35877 3.333951 0.304234
N  -0.694738 2.475415 0.18372
N  -3.590492 -2.27338 -0.041876
N  -1.20955 -2.422569 -0.026246
N  -0.08302 -4.569559 -0.336842
N  1.187725 -2.611871 -0.193184
N  2.720512 -0.940194 -0.31183
N  0.460141 -0.380986 0.379733
C  -1.87045 2.408473 -0.77142
C  -2.967355 1.455448 -0.323467
C  -1.166237 2.855569 1.560726
C  0.30291 3.476563 -0.32379
C  -2.785229 0.060154 -0.440213
C  -4.194724 1.934462 0.206727
C  -0.119263 2.635214 2.665541
C  0.950032 3.095811 -1.668526
C  -3.754956 -0.8633 0.028637
C  -5.198857 1.02959 0.623778
C  -4.973796 -0.358697 0.554756
C  -2.42102 -3.033518 -0.125107
C  -2.518667 -4.445477 -0.296786
C  -1.311627 -5.174191 -0.378972
C  -0.062457 -3.203724 -0.17468
C  -1.299071 -6.677617 -0.537202
C  3.477089 0.224607 -0.103132
C  1.393858 -1.292798 -0.015686
C  4.663083 0.369889 -0.883898
C  3.155878 1.211864 0.87199
C  4.022695 2.308423 1.017348
C  5.488199 1.483209 -0.679783
C  5.198183 2.488511 0.264372
H  -1.477348 2.066665 -1.744361
H  -2.299783 3.425461 -0.912159
H  -2.046657 2.230817 1.787274
H  -1.516013 3.916382 1.567567
H  1.097243 3.565947 0.437457
H  -0.175404 4.484422 -0.412969
H  -1.873325 -0.312918 -0.906924
H  0.196996 1.576432 2.69665
H  0.777322 3.266526 2.545539
H  -0.564678 2.880693 3.647392
H  1.780691 3.790733 -1.888215
H  1.368321 2.073731 -1.633622
H  0.241232 3.151809 -2.513162
H  -6.149406 1.404383 1.024933
H  -5.744754 -1.049682 0.916944
H  -4.451355 -2.819965 0.01601
H  -5.246869 3.55565 0.678456
H  -3.487446 -4.949251 -0.366645
H  -0.741174 -7.137798 0.297737
H  -2.317723 -7.09966 -0.565981
H  -0.767361 -6.954113 -1.465026
H  3.198246 -1.74751 -0.725399
H  4.918654 -0.37749 -1.640919
H  2.288861 1.098443 1.524669
H  5.850105 3.351581 0.408513
H  0.474491 0.652229 0.295328
H  -0.47856 -0.829659 0.455938
