program: Gaussian 09
title: 000291716
version: EM64L-G09RevD.01
frameworkgroup: C1[X(C17H16O6)]
method: RPBEPBE
basis: SDD
operation: Freq
keyword: #pfreq=noraman
keyword: PBEPBE/SDD
title: #p freq=noraman PBEPBE/SDD
converged: YES YES NO NO
title: Mulliken charges:
elementType: O O O O O O C C C C C C C C C C C C C C C C C H H H H H H H H H H H H H H H H
charge: -0.294691 -0.216567 -0.232452 -0.258818 -0.215194 -0.229350 0.223193 0.330129 0.261459 -0.494361 0.214461 0.217065 -0.516694 0.168034 -0.495707 0.420586 -0.320926 -0.382057 -0.217666 -0.225245 -0.540548 -0.537355 -0.512489 0.298526 0.247718 0.311306 0.259762 0.239031 0.161610 0.166521 0.245741 0.224529 0.254658 0.221717 0.223509 0.252540 0.300316 0.223483 0.224225
chargesum: 0.00000
title: Mulliken charges with hydrogens summed into heavy atoms:
elementType: O O O O O O C C C C C C C C C C C C C C C C C
charge: -0.294691 -0.216567 -0.232452 -0.258818 -0.215194 -0.229350 0.223193 0.330129 0.261459 -0.195835 0.214461 0.217065 -0.268976 0.168034 -0.184402 0.420586 -0.061164 -0.143026 -0.056056 -0.058724 0.184381 0.160411 0.235534
polarizability: 2.89206238e+02 6.16162150e-01 2.76572195e+02 1.20564645e+01 -2.05512098e+00 1.31850368e+02
1716.lowfreq: -3.1927 0.0006 0.0006 0.0009 4.5255 5.4501 17.4658 26.0212 42.5499
frequency: 17.4007 26.0133 42.5483 45.9839 66.2989 87.1375 100.5407 122.2723 138.0792 153.6435 160.4998 169.3192 180.5047 188.2563 196.5252 214.8804 227.7677 233.3382 240.4233 252.6259 299.0529 314.6258 337.4427 343.0709 359.9496 373.9887 397.9342 411.5876 454.5436 466.8674 482.1686 516.7770 542.3483 572.1751 579.7048 595.9954 632.3595 673.1349 691.6650 718.1079 736.6990 745.2109 752.3448 784.2156 823.1132 835.7558 855.5666 862.2560 923.5680 944.4636 951.8746 953.6199 971.9707 974.2644 988.2746 989.8144 1084.5185 1106.6058 1112.5879 1113.9725 1120.2300 1145.6475 1157.9375 1160.4810 1162.8352 1184.6457 1212.6055 1214.4369 1259.5804 1264.7352 1275.6053 1292.5288 1357.5458 1363.5824 1394.4172 1404.2967 1421.9897 1427.7083 1438.6196 1442.6554 1447.2165 1466.9944 1467.1860 1468.8879 1470.4543 1471.7719 1473.7134 1494.2247 1510.9423 1557.0914 1567.5400 1592.2869 1606.3844 1613.5854 1617.4999 2841.1357 2875.8490 2959.0387 2971.0657 3002.4425 3047.7509 3065.8547 3114.5030 3131.3361 3133.6317 3139.5366 3139.6668 3140.9194 3153.6250 3172.9983 3183.0627
redmass: 5.1432 7.2556 5.5379 3.7943 4.7287 3.5227 6.1617 3.9728 5.3965 5.0778 4.3216 4.5846 4.4631 3.1490 3.1181 2.3585 1.4585 1.3399 2.3373 1.5317 2.5458 3.5178 5.6862 5.3051 4.1624 6.1599 6.3229 6.3067 3.2764 3.4937 5.7042 5.8136 6.0092 6.3435 4.3739 7.2359 5.5529 7.3398 6.8041 4.3510 6.0199 2.4294 4.9746 6.3103 1.3915 4.4057 1.6472 1.6555 1.3513 6.1077 8.4100 1.3936 3.6141 1.9448 3.8312 2.1108 3.1873 1.2847 1.2609 1.2598 2.1608 1.6910 1.4342 1.2649 1.7147 2.0781 2.7033 3.0901 1.4398 2.1176 2.0196 5.4204 3.4436 2.6762 2.2798 2.2947 2.6606 2.4475 1.2135 1.2549 1.4258 1.0753 1.0504 1.0970 1.0565 1.0810 1.0528 2.5853 2.9732 9.1353 9.5776 6.0722 6.1805 7.0450 6.8239 1.0829 1.0850 1.0333 1.0327 1.0291 1.1041 1.1048 1.1043 1.0989 1.0894 1.1063 1.1013 1.0901 1.0910 1.0951 1.0904
irintensity: 0.9693 1.8746 2.3504 1.1842 0.3733 4.1596 8.2399 20.6340 4.2388 0.5173 4.4192 10.4935 2.8911 5.9295 3.7381 2.0602 0.1081 2.5963 5.6797 2.5945 3.1911 3.7468 0.8131 2.5402 6.7069 0.7801 1.6497 12.1319 6.5499 0.1892 4.5439 29.0208 1.6659 15.5254 4.0454 21.6231 16.1774 3.4186 12.2059 7.3947 18.0202 1.8869 13.4980 26.2633 45.6470 49.6777 39.0166 16.6321 1.6126 2.4513 70.4259 4.2807 17.7100 8.2200 34.2798 29.6114 70.2927 6.0138 0.0426 0.5905 136.2674 26.2213 32.7625 23.2415 74.1495 333.5236 146.9722 12.4994 17.0518 81.6393 94.4146 423.3504 276.4292 11.3870 71.1137 31.6007 24.6614 22.0240 29.8274 42.8332 29.1112 32.1706 16.1729 146.1150 38.7033 7.4702 22.4355 153.0487 235.2281 66.4496 272.0669 263.1266 151.4432 221.6895 3.4241 166.0938 152.1378 70.9213 40.7076 55.2448 44.7559 30.5072 41.7922 22.4644 8.0197 20.8704 9.6792 7.6455 4.6492 6.4201 0.7036
temp: 298.150 k
press: 1.00000 atm
elementType: 8 8 8 8 8 8 6 6 6 6 6 6 6 6 6 6 6 6 6 6 6 6 6 1 1 1 1 1 1 1 1 1 1 1 1 1 1 1 1
symmnumber: 1
zpe: 770027.4 jmol-1
zpe.correction: 0.293288 hartree
zpe.thermalcorrener: 0.315840 hartree
zpe.thermalcorrenthalpy: 0.316785 hartree
zpe.thermalcorrgfe: 0.240141 hartree
zpe.sumelectzpe: -1107.001332 hartree
zpe.sumelectthermal: -1106.978780 hartree
zpe.sumelectthermalent: -1106.977836 hartree
zpe.sumelectthermalfe: -1107.054479 hartree
dipole: -2.2821 -0.1876 2.6265
dipole: 3.4845
quadrupole: -106.7130 -144.3719 -136.1423
quadrupole: 10.1255 8.7573 6.1368
quadrupole: 22.3627 -15.2962 -7.0666 10.1255 8.7573 6.1368
hfenergy: -1107.2946202 hartree
pointgroup: C01 [X(C17H16O6)]
dipole: 0.9997999 -0.9377268 -0.0209763 debye
polarizability: 285.2226304|27.4614836|136.7626649|2.1527713|-11.4894998|275.6435054 unknown
InChI: InChI=1S/C17H16O6/c1-20-13-5-4-11(9-18)6-17(13)23-14-8-16(22-3)15(21-2)7-12(14)10-19/h4-10H,1-3H3
charge 0 multiplicity 1
39 atoms
O  -0.586832 -0.413742 1.077107
O  2.771279 -0.902745 -2.509686
O  4.623315 0.218036 -0.98908
O  -2.937313 -1.777968 2.124486
O  0.373506 0.753518 3.444452
O  -2.328639 1.374009 -3.563898
C  0.692868 -0.220379 0.531444
C  1.667828 0.375267 1.379665
C  -1.773139 -0.455285 0.307605
C  1.037012 -0.66896 -0.763437
C  2.351849 -0.508009 -1.249801
C  3.355091 0.102007 -0.418126
C  2.994612 0.522922 0.868988
C  -2.893596 -1.128433 0.905937
C  -1.921104 0.200948 -0.923914
C  -3.15234 0.156673 -1.628365
C  -4.124279 -1.154313 0.192431
C  -4.256488 -0.530754 -1.055875
C  1.426705 0.855611 2.755038
C  -3.27576 0.805696 -2.946949
C  1.761267 -1.448995 -3.43053
C  5.66341 0.852948 -0.17472
C  -1.825246 -1.769775 3.110467
H  0.280977 -1.153698 -1.383854
H  3.739267 0.987439 1.52485
H  -1.096918 0.768236 -1.3681
H  -4.960043 -1.678169 0.665156
H  -5.212779 -0.569865 -1.590827
H  2.327365 1.35897 3.195761
H  -4.299845 0.758225 -3.397084
H  0.949739 -0.718304 -3.607992
H  1.342646 -2.397476 -3.043939
H  2.308512 -1.636617 -4.364701
H  5.856951 0.27619 0.750893
H  5.39091 1.894831 0.083911
H  6.561342 0.849889 -0.808775
H  -1.451395 -0.752485 3.301679
H  -0.995466 -2.402086 2.752571
H  -2.280465 -2.209059 4.011009
