program: Gaussian 09
title: 000291682
version: EM64L-G09RevD.01
frameworkgroup: C1[X(C5H6F3NO3)]
method: RPBEPBE
basis: SDD
operation: Freq
keyword: #p
keyword: freq=noraman
keyword: PBEPBE/SDD
title: #p freq=noraman PBEPBE/SDD
converged: YES YES NO NO
title: Mulliken charges:
elementType: F F F O O O N C C C C C H H H H H H
charge: -0.173921 -0.141507 -0.139538 -0.397956 -0.216189 -0.233134 -0.401338 -0.089818 -0.663758 0.182469 0.158710 0.308393 0.291398 0.379821 0.247544 0.270639 0.221983 0.396202
chargesum: 0.00000
title: Mulliken charges with hydrogens summed into heavy atoms:
elementType: F F F O O O N C C C C C
charge: -0.173921 -0.141507 -0.139538 -0.001754 -0.216189 -0.233134 -0.021517 0.201579 0.076409 0.182469 0.158710 0.308393
polarizability: 8.82147930e+01 3.42306597e+00 7.35957727e+01 -5.50752855e-01 -4.38593593e+00 5.16454351e+01
1716.lowfreq: -4.8152 -2.7395 -0.0013 -0.0009 -0.0009 8.0446 21.2055 59.5868 61.5327
frequency: 21.0395 59.5788 61.5323 92.3640 109.2139 210.3659 223.0130 230.9472 246.8330 286.6576 298.2967 374.5353 396.2174 446.3313 481.7219 538.1192 569.8751 608.4439 637.1546 687.6804 706.8451 721.2433 775.1407 866.2982 920.4682 1018.5519 1036.2614 1050.2609 1065.8913 1082.7721 1114.7936 1171.2778 1237.0135 1257.8211 1304.2997 1354.0621 1393.3372 1466.5544 1481.2749 1499.6487 1643.6297 1660.2093 3005.9358 3019.4013 3112.8241 3121.3771 3475.3663 3521.3089
redmass: 12.7954 11.1988 5.5985 7.4872 5.6006 3.9493 8.7598 1.1179 10.3032 4.8944 8.6049 9.9699 5.4436 12.2373 6.4873 5.3030 3.0413 1.5343 11.9584 1.7731 3.0806 2.7746 4.9336 3.2538 2.3099 10.2269 12.5075 2.7996 1.6912 3.2488 3.0812 3.1216 1.5431 1.9037 1.2989 2.0020 1.3175 1.1426 1.0472 1.8407 11.3483 8.8359 1.0354 1.0824 1.1016 1.1015 1.0782 1.0643
irintensity: 0.0077 0.8411 2.7069 2.2580 0.7231 1.7939 11.9849 0.9081 6.6106 0.3185 0.0304 3.7361 10.9294 12.5446 18.8860 55.7432 35.9782 98.6913 6.1692 9.0775 129.3333 23.0492 10.0699 51.1672 31.8099 194.0715 240.6301 160.5026 8.7779 66.8909 180.1110 54.1694 21.9725 17.8334 18.1577 40.9708 25.9776 78.0780 19.9084 106.5775 354.8220 103.1683 10.3863 9.5233 13.0432 8.0839 109.3151 44.0139
temp: 298.150 k
press: 1.00000 atm
elementType: 9 9 9 8 8 8 7 6 6 6 6 6 1 1 1 1 1 1
symmnumber: 1
zpe: 309018.1 jmol-1
zpe.correction: 0.117699 hartree
zpe.thermalcorrener: 0.130079 hartree
zpe.thermalcorrenthalpy: 0.131023 hartree
zpe.thermalcorrgfe: 0.077265 hartree
zpe.sumelectzpe: -773.169682 hartree
zpe.sumelectthermal: -773.157302 hartree
zpe.sumelectthermalent: -773.156358 hartree
zpe.sumelectthermalfe: -773.210116 hartree
dipole: -5.2629 -0.4936 0.6545
dipole: 5.3263
quadrupole: -62.3256 -75.5021 -68.2572
quadrupole: -1.5932 1.7577 3.9234
quadrupole: 6.3693 -6.8071 0.4378 -1.5932 1.7577 3.9234
hfenergy: -773.2873806 hartree
pointgroup: C01 [X(C5H6F3N1O3)]
dipole: -2.0753371 0.1789427 -0.2286326 debye
dipolederiv: -0.4649111 0.0026304 -0.0093213 0.039112 -0.8102942 0.1447214 -0.0150399 0.1491234 -0.3285783 -0.5896977 0.0825791 0.2484715 0.0438081 -0.354656 -0.1333332 0.2321022 -0.1609164 -0.557957 -0.5695493 -0.0618672 -0.2687446 -0.0849981 -0.2785305 -0.0497294 -0.2211334 -0.0143783 -0.6520547 -1.1973838 -0.2754652 0.2262405 -0.2284564 -0.3354397 0.0361057 0.2177292 0.0460919 -0.4571819 -0.6248562 -0.0299506 -0.0125942 0.3550833 -0.7899625 0.1817637 -0.1379641 0.146772 -0.3751815 -0.7044273 0.0763396 0.0655816 -0.1851973 -0.9273756 0.0903267 0.111054 0.1048586 -0.3224154 -1.0650407 0.2466452 -0.152136 0.2948941 -0.5814126 0.0063769 -0.1366318 0.0141072 -0.4546363 0.4267049 0.1369244 0.0748947 0.3668514 -0.0751823 -0.0059 -0.0110988 0.0249452 0.2847078 -0.1389945 0.084305 -0.0063617 -0.0292257 0.0172256 -0.0317364 -0.0223121 -0.0251519 0.042825 1.1179054 -0.2330165 0.1372908 -0.5694526 0.9527261 -0.3171415 0.2306163 -0.2713819 0.2177742 1.5040976 -0.0083555 -0.3298362 0.151151 1.2261379 -0.1580186 -0.3148666 -0.1990743 0.2693619 1.5119639 -0.0897351 0.0466035 -0.0549857 1.3317695 0.0773934 0.0237182 0.0726876 1.5519102 0.0323795 0.0166972 -0.020082 -0.0586218 0.0855735 0.0426786 0.0347236 0.0140306 -0.0222341 0.3265751 0.0018902 -0.0264529 -0.1318638 0.2719012 0.0242196 0.0098464 0.0168534 0.3192626 -0.0642107 -0.0935857 0.0146325 -0.1070889 0.0884331 -0.008884 0.0099475 0.0186195 0.0795887 0.0457194 0.1030562 0.011821 0.1002009 0.0164421 -0.0226285 0.0139943 -0.0126536 0.0846038 0.1154438 -0.0169317 0.0018933 0.0001943 0.0169614 0.1046351 -0.0103141 0.0395003 -0.0774927 0.3382816 0.05784 -0.0019006 0.0985954 0.1456832 0.0191507 -0.014371 0.0359668 0.3976975 unknown
polarizability: 88.3293474|-3.2339893|74.0322529|0.0938989|-2.6011412|51.0944005 unknown
InChI: InChI=1S/C5H6F3NO3/c1-2(3(10)11)9-4(12)5(6,7)8/h2,9-10H,1H3
charge 0 multiplicity 1
18 atoms
F  1.955872 1.649781 -0.466315
F  3.069058 -0.230329 -1.091468
F  3.032665 0.389133 1.08842
O  -3.784159 0.021248 0.461014
O  1.090395 -1.751085 0.514886
O  -2.342591 1.750659 -0.123623
N  -0.183379 0.116083 -0.101429
C  -1.482246 -0.55517 0.065608
C  -1.777127 -1.571978 -1.071276
C  0.984037 -0.551399 0.143124
C  -2.543567 0.539669 0.120652
C  2.2589 0.310805 -0.079579
H  -1.482694 -1.103392 1.026989
H  -0.195663 1.110522 -0.361923
H  -2.751506 -2.057245 -0.897889
H  -0.989757 -2.342691 -1.073552
H  -1.793365 -1.06949 -2.053531
H  -4.467172 0.745277 0.476293
