program: Gaussian 09
title: 000291679
version: EM64L-G09RevD.01
frameworkgroup: C1[X(C12H15BrO3)]
method: RPBEPBE
basis: SDD
operation: Freq
keyword: #p
keyword: freq=noraman
keyword: PBEPBE/SDD
title: #p freq=noraman PBEPBE/SDD
converged: YES YES NO NO
title: Mulliken charges:
elementType: Br O O O C C C C C C C C C C C C H H H H H H H H H H H H H H H
charge: 0.016431 -0.272236 -0.388801 -0.320746 -0.188553 0.202470 0.212727 0.010762 0.212775 -0.689646 -0.695692 -0.323767 0.322519 -0.473209 -0.791949 -0.516844 0.225066 0.234213 0.235395 0.226287 0.222082 0.212073 0.241077 0.253368 0.256379 0.248740 0.235816 0.386285 0.227488 0.237822 0.241668
chargesum: 0.00000
title: Mulliken charges with hydrogens summed into heavy atoms:
elementType: Br O O O C C C C C C C C C C C C
charge: 0.016431 -0.272236 -0.002515 -0.320746 0.036513 0.202470 0.212727 0.010762 0.212775 0.006248 -0.020459 -0.070400 0.322519 -0.473209 -0.051014 0.190134
polarizability: 2.28458373e+02 2.03342511e+00 1.81542077e+02 1.04024957e+00 -1.25579727e+00 8.93268849e+01
1716.lowfreq: -5.6985 -0.0007 -0.0006 -0.0005 7.1204 7.6547 38.0299 43.5423 50.9192
frequency: 37.7670 43.4163 50.9139 79.1122 103.2642 107.5282 114.2505 143.9356 144.7956 178.1918 187.8159 194.6193 225.6021 235.2622 261.8643 270.3630 296.1966 321.9237 343.5051 375.9021 393.9053 395.5961 437.3587 494.7171 515.1318 618.2811 626.0899 654.3048 684.2810 727.0123 738.6759 781.3721 838.6506 873.8314 880.5810 907.3555 927.5946 964.0429 967.6185 982.0682 1044.6764 1066.9158 1081.8768 1098.3008 1108.5197 1113.6536 1149.7175 1174.2830 1212.5293 1253.3097 1261.2830 1288.1982 1320.2980 1370.4730 1377.0788 1382.9183 1389.5027 1399.0734 1401.3008 1415.5071 1448.1429 1458.5683 1461.4777 1462.9859 1467.6246 1470.0151 1473.7764 1476.9167 1491.0772 1541.2854 1561.4325 1615.5591 2656.9998 2970.6201 2985.7327 2988.9377 2991.7277 3005.6424 3064.8050 3069.4831 3084.5880 3087.9123 3089.9121 3103.9894 3118.0229 3128.2445 3172.8559
redmass: 3.9330 2.6021 2.5111 3.4624 1.4753 3.2381 5.6438 2.6174 1.3509 2.0642 1.4198 3.4385 1.2909 4.3183 3.4306 4.0426 2.9457 5.0958 6.5552 4.6788 4.6197 4.5286 4.5890 6.8578 3.4771 4.9509 4.8810 7.5359 5.7950 4.9124 5.5343 4.3816 3.9805 1.5408 4.5498 3.0019 1.1943 1.4575 2.6827 1.0875 1.4988 2.2916 1.7374 2.6222 1.2540 2.7200 1.3679 1.9689 2.2613 6.9510 1.9599 1.6934 2.0982 2.0732 1.5531 2.1520 2.1516 1.4877 1.5807 2.0425 1.4356 1.0607 1.0458 1.0538 1.1728 1.0502 1.1083 1.0468 1.0797 5.7115 3.8495 3.6545 1.0728 1.0311 1.0343 1.0397 1.0368 1.0819 1.1044 1.0935 1.1008 1.1001 1.1007 1.0996 1.1002 1.1016 1.0915
irintensity: 1.6059 2.0501 2.2348 1.2410 1.5124 0.4105 0.9554 0.5462 0.2864 0.6664 0.0895 5.9123 1.4433 0.7532 0.0569 2.9739 4.3644 2.4504 10.2013 3.4965 7.1227 5.8336 2.7724 17.4425 2.8402 8.5118 22.2399 2.2731 1.4227 39.0997 1.5375 6.1760 14.8095 17.1874 17.3991 38.6062 5.7184 3.1723 12.0006 130.5882 3.0523 81.3392 37.2677 88.9822 0.4520 19.6524 14.9257 3.1372 75.0204 86.4792 146.3593 128.2432 59.4737 154.4794 21.1320 72.9604 61.3294 60.9814 17.0997 81.4900 13.9834 21.2285 7.3064 10.7756 5.4717 2.3686 31.4538 17.2942 24.7568 50.6915 26.0544 190.8951 383.5715 61.5211 24.3949 19.6677 34.9066 13.7015 31.9413 11.2792 18.0972 48.4796 17.8782 26.0729 6.2168 21.9806 0.7110
temp: 298.150 k
press: 1.00000 atm
elementType: 35 8 8 8 6 6 6 6 6 6 6 6 6 6 6 6 1 1 1 1 1 1 1 1 1 1 1 1 1 1 1
symmnumber: 1
zpe: 636906.5 jmol-1
zpe.correction: 0.242585 hartree
zpe.thermalcorrener: 0.260387 hartree
zpe.thermalcorrenthalpy: 0.261331 hartree
zpe.thermalcorrgfe: 0.195614 hartree
zpe.sumelectzpe: -704.197239 hartree
zpe.sumelectthermal: -704.179437 hartree
zpe.sumelectthermalent: -704.178492 hartree
zpe.sumelectthermalfe: -704.244210 hartree
dipole: -0.4514 -1.4270 1.6934
dipole: 2.2600
quadrupole: -100.8838 -105.1066 -105.1176
quadrupole: -14.0137 -6.7762 1.3552
quadrupole: 2.8188 -1.4040 -1.4149 -14.0137 -6.7762 1.3552
hfenergy: -704.4398238 hartree
pointgroup: C01 [X(C12H15Br1O3)]
dipole: -0.0076866 -0.6018155 0.6544791 debye
polarizability: 224.6647455|12.7456795|185.1959959|-4.5898477|0.5099384|89.4665938 unknown
InChI: InChI=1S/C12H15BrO3/c1-6(2)10(14)8-5-9(13)12(16-4)7(3)11(8)15/h5-6,15H,1-4H3
charge 0 multiplicity 1
31 atoms
Br -2.099553 -3.058246 -0.129698
O  -3.523917 -0.264979 -0.315971
O  0.377772 2.56843 -0.206936
O  2.64985 1.527052 -0.090002
C  3.133586 -0.857876 -0.025352
C  0.705883 0.13907 -0.096468
C  2.165946 0.325852 -0.056567
C  -0.148006 1.300274 -0.175149
C  -1.568334 1.177942 -0.222334
C  3.347044 -1.364271 -1.485731
C  4.475976 -0.470201 0.630672
C  0.096526 -1.151057 -0.076776
C  -2.132726 -0.119184 -0.194617
C  -1.291403 -1.274579 -0.124966
C  -2.424016 2.419379 -0.323386
C  -4.266039 -0.340139 0.962589
H  2.676757 -1.679235 0.559194
H  3.803333 -0.569027 -2.10197
H  2.399395 -1.670884 -1.963208
H  4.030159 -2.23215 -1.481623
H  4.335853 -0.157997 1.680737
H  5.166888 -1.332206 0.613271
H  4.942613 0.371514 0.092234
H  0.71425 -2.050807 -0.026569
H  -1.989727 3.121481 -1.055226
H  -3.450645 2.159814 -0.624582
H  -2.457696 2.960075 0.641634
H  1.415572 2.45912 -0.171015
H  -4.12919 0.589985 1.546471
H  -3.936158 -1.212452 1.556349
H  -5.322193 -0.457597 0.678998
