program: Gaussian 09
title: 000291725
version: EM64L-G09RevD.01
frameworkgroup: C1[X(C22H30O6)]
method: RPBEPBE
basis: SDD
operation: Freq
keyword: #pfreq=noraman
keyword: PBEPBE/SDD
title: #p freq=noraman PBEPBE/SDD
converged: YES YES NO NO
title: Mulliken charges:
elementType: O O O O O O C C C C C C C C C C C C C C C C C C C C C C H H H H H H H H H H H H H H H H H H H H H H H H H H H H H H
charge: -0.439149 -0.439149 -0.240914 -0.240913 -0.239044 -0.239044 -0.102504 -0.102504 -0.612466 -0.612467 -0.400245 -0.400246 0.574000 0.573997 -0.608822 -0.608818 -0.439771 -0.439771 0.211111 0.211109 -0.348475 -0.348475 0.187036 0.187036 -0.537679 -0.537680 -0.538639 -0.538639 0.250822 0.250822 0.213874 0.207949 0.213874 0.207949 0.205190 0.226419 0.205190 0.226420 0.246953 0.246953 0.244768 0.244768 0.332906 0.332906 0.240606 0.240606 0.246875 0.218430 0.218259 0.246875 0.218430 0.218259 0.245864 0.217873 0.218775 0.245863 0.217873 0.218775
chargesum: 0.00000
title: Mulliken charges with hydrogens summed into heavy atoms:
elementType: O O O O O O C C C C C C C C C C C C C C C C C C C C C C
charge: -0.106243 -0.106243 -0.240914 -0.240913 -0.239044 -0.239044 0.148318 0.148319 -0.190642 -0.190645 0.031364 0.031364 0.574000 0.573997 -0.361869 -0.361865 -0.195003 -0.195003 0.211111 0.211109 -0.107869 -0.107868 0.187036 0.187036 0.145884 0.145884 0.143873 0.143873
polarizability: 3.83355381e+02 -1.51902156e+00 2.28073325e+02 7.91331482e-04 -1.06525782e-03 2.10987855e+02
1716.lowfreq: -4.1903 -0.0012 -0.0006 -0.0002 4.8583 10.7122 13.8389 14.4044 20.2625
frequency: 13.6877 14.4027 20.2085 28.4249 43.2029 49.1439 58.5080 81.2196 83.2776 89.7769 91.0245 105.5748 116.9869 125.4393 148.9408 149.2782 164.0984 167.3757 184.7118 186.1902 198.0381 198.6048 231.8869 238.7867 243.4109 246.3272 265.9064 269.1847 279.5865 306.8960 343.3488 347.0558 350.4760 357.8698 358.8282 364.9569 368.5648 422.8003 435.7509 458.2540 459.0461 465.6453 493.6990 503.5523 528.3201 550.3333 572.5691 579.1818 590.9773 620.3739 637.0480 715.6802 724.0129 732.6005 734.4410 738.2713 750.0015 779.7895 807.5301 813.0464 841.0447 860.0306 866.8321 870.8862 906.3301 912.3149 922.5448 922.9627 945.1745 969.8452 975.8216 984.6975 985.7171 993.5175 1000.4884 1004.5013 1040.3173 1068.4173 1076.8255 1110.8263 1110.9266 1111.2129 1112.2608 1112.2628 1119.1907 1133.4161 1135.1508 1143.3018 1144.5619 1156.4196 1156.7429 1172.1148 1177.5912 1179.0781 1213.2051 1222.7630 1223.7762 1229.3493 1249.4364 1262.2468 1264.7918 1280.6442 1281.8920 1295.3145 1308.3966 1311.2420 1341.1544 1346.9852 1355.9725 1361.6739 1370.9294 1376.0136 1392.3619 1393.2426 1409.9726 1410.7575 1435.8394 1435.8983 1444.5398 1444.9047 1463.6629 1465.4275 1465.4405 1466.1462 1466.1476 1470.0076 1470.2300 1470.4870 1471.9248 1472.0859 1477.9668 1480.0346 1507.1054 1508.0747 1591.0697 1591.0894 1610.5585 1610.7257 2953.0866 2953.0937 2954.2729 2954.3604 2961.5108 2967.9119 2972.0587 2974.9412 2977.0630 2979.0496 3027.9489 3028.0799 3039.2957 3039.3047 3039.6667 3039.6747 3056.2655 3057.1748 3122.8756 3122.9043 3123.1233 3123.1653 3125.4242 3125.4335 3142.3795 3142.3860 3160.9241 3160.9449 3559.8139 3560.0070
redmass: 4.8873 4.5275 4.5268 4.7392 4.9822 4.5676 4.8268 3.6011 3.6445 3.3295 4.0596 3.9773 3.9250 3.9205 3.6759 3.7896 2.9384 2.7005 2.9900 2.5533 2.1018 1.9405 1.4332 1.2189 2.6286 1.9675 1.7729 1.7601 1.3201 2.7067 1.9172 3.2247 1.5774 3.1265 2.8813 3.9435 4.1110 4.2581 2.9012 3.6740 3.2519 5.1290 4.9257 4.3496 3.2883 5.0309 3.6509 3.9653 4.2139 4.2684 4.1499 5.2775 4.3842 4.5989 3.9563 3.5119 3.3432 2.0809 1.4821 1.6327 1.7084 1.6026 1.8248 1.8358 3.6509 3.5363 1.4137 1.4393 2.1076 3.3822 3.2940 8.1847 7.4975 3.0240 4.0284 3.7804 2.3039 1.7302 3.1852 1.3346 1.2617 1.4729 1.2613 1.2612 1.2402 2.2105 2.3242 1.5164 1.4210 1.4143 1.4156 1.6569 1.5172 1.5012 1.4414 2.0791 1.8668 1.4547 1.2176 3.0988 3.2443 1.5140 1.7017 1.5259 1.2566 1.1752 1.2919 1.4340 1.2910 1.2893 1.3026 1.3914 4.4938 4.8525 2.4303 2.2993 1.1821 1.1809 1.3601 1.3788 1.0938 1.0509 1.0506 1.0504 1.0504 1.0909 1.0904 1.0827 1.0582 1.0650 1.0922 1.1020 2.6339 2.6767 7.2143 7.2238 6.5306 6.5061 1.0332 1.0332 1.0333 1.0333 1.0782 1.0786 1.0627 1.0639 1.0628 1.0635 1.1004 1.1015 1.1036 1.1036 1.1036 1.1036 1.1003 1.1003 1.0977 1.0978 1.0985 1.0984 1.0905 1.0905 1.0901 1.0901 1.0937 1.0937 1.0660 1.0660
irintensity: 0.0751 0.0002 0.1330 0.0177 0.0086 0.4300 3.4992 5.2153 17.2246 5.4849 2.5156 0.0113 0.1607 1.1508 0.3649 1.2156 3.9046 15.6401 1.8346 1.7074 2.5565 0.0399 3.8098 0.0074 1.6694 3.9246 3.4375 0.0126 135.4208 133.2906 17.0373 1.0967 8.9184 0.8836 5.0463 1.8343 39.7467 5.6351 0.0006 1.4786 0.6423 0.2991 1.0786 3.8467 1.5305 5.3041 0.7876 0.9452 49.0283 7.5640 13.9969 0.0589 23.8103 1.3936 12.8582 0.1122 3.2596 31.2863 31.4493 21.1305 7.1080 39.0674 14.3840 2.5422 3.6700 7.9172 0.6868 0.2563 45.3813 142.5820 0.4900 50.3722 28.1486 1.0974 72.1594 11.6156 29.2023 1.3737 6.0026 0.0567 0.0249 0.3083 0.1189 0.3150 56.3433 146.9234 103.7570 0.6322 2.3629 17.4012 6.7580 18.5455 21.2329 10.1146 53.7492 20.1355 162.8472 3.0867 15.0633 335.5744 15.6902 32.9104 10.9180 6.4526 7.5608 27.4593 0.2827 10.0319 0.9201 38.6499 0.4736 1.1449 4.1331 11.0739 14.7871 28.9883 31.7961 3.1228 5.1300 17.3146 1.1643 10.1155 10.6266 20.0494 15.6052 155.2864 2.3029 18.2921 67.3634 13.2801 8.7412 13.8366 318.8240 4.1752 50.7933 28.0772 18.3592 17.6519 84.8863 153.3557 35.8752 4.3682 4.7242 0.5542 64.8074 16.7920 88.3918 37.2990 10.7787 29.3159 2.6855 4.0791 79.1146 117.4491 22.9732 81.4904 72.1497 0.4841 47.0607 8.6763 2.0699 0.2602 9.7449 15.7743 15.2021 6.3118 4.9206 6.4997
temp: 298.150 k
press: 1.00000 atm
elementType: 8 8 8 8 8 8 6 6 6 6 6 6 6 6 6 6 6 6 6 6 6 6 6 6 6 6 6 6 1 1 1 1 1 1 1 1 1 1 1 1 1 1 1 1 1 1 1 1 1 1 1 1 1 1 1 1 1 1
symmnumber: 1
zpe: 1258430.1 jmol-1
zpe.correction: 0.479311 hartree
zpe.thermalcorrener: 0.509843 hartree
zpe.thermalcorrenthalpy: 0.510788 hartree
zpe.thermalcorrgfe: 0.414690 hartree
zpe.sumelectzpe: -1305.449548 hartree
zpe.sumelectthermal: -1305.419015 hartree
zpe.sumelectthermalent: -1305.418071 hartree
zpe.sumelectthermalfe: -1305.514169 hartree
dipole: 0.0000 0.0000 0.1605
dipole: 0.1605
quadrupole: -169.5931 -162.3493 -154.7186
quadrupole: -9.8304 0.0005 0.0001
quadrupole: -7.3727 -0.1290 7.5017 -9.8304 0.0005 0.0001
hfenergy: -1305.9288583 hartree
pointgroup: C01 [X(C22H30O6)]
dipole: 0.0000014 -0.0000013 0.063148 debye
polarizability: 383.3567245|1.4487103|228.0719815|0.0008115|-0.0010499|210.9878546 unknown
InChI: InChI=1S/C22H30O6/c1-25-19-7-5-15(11-21(19)27-3)9-17(13-23)18(14-24)10-16-6-8-20(26-2)22(12-16)28-4/h5-8,11-12,17-18,23-24H,9-10,13-14H2,1-4H3
charge 0 multiplicity 1
58 atoms
O  -0.476475 -2.089127 -2.403419
O  0.476519 2.08896 -2.403549
O  -6.12762 -1.487863 1.538695
O  6.127589 1.488012 1.538605
O  -7.259981 0.315314 -0.037553
O  7.259971 -0.315332 -0.037436
C  -0.759135 -0.173348 -0.808377
C  0.759144 0.173286 -0.808373
C  -1.501937 0.2653 0.491575
C  1.501921 -0.265275 0.491622
C  -0.997482 -1.673141 -1.085877
C  0.997496 1.673061 -1.085968
C  -3.018771 0.300273 0.340874
C  3.018758 -0.300262 0.340947
C  -3.843492 -0.626238 1.03286
C  3.843469 0.626324 1.032842
C  -3.636282 1.254157 -0.497215
C  3.63628 -1.254235 -0.497034
C  -5.24888 -0.608193 0.89357
C  5.248859 0.608269 0.893568
C  -5.043074 1.288134 -0.645572
C  5.043073 -1.288225 -0.645373
C  -5.86182 0.365013 0.040836
C  5.86181 -0.365027 0.040944
C  -5.536984 -2.501511 2.412919
C  5.53694 2.501754 2.412712
C  -7.91236 1.303848 -0.896969
C  7.912361 -1.303962 -0.896733
H  -1.207049 0.395537 -1.651442
H  1.207076 -0.395655 -1.651391
H  -1.222603 -0.411861 1.32259
H  -1.142849 1.274273 0.77549
H  1.222574 0.411943 1.322586
H  1.142826 -1.274228 0.775599
H  -0.448132 -2.309461 -0.368999
H  -2.078211 -1.907945 -1.00392
H  0.448129 2.309428 -0.369145
H  2.078223 1.907872 -1.004002
H  -3.372234 -1.364788 1.690179
H  3.372204 1.364943 1.690079
H  -3.02063 1.98402 -1.036669
H  3.020635 -1.984157 -1.036417
H  -0.989673 -1.610407 -3.10281
H  0.989734 1.610195 -3.102897
H  -5.494739 2.042216 -1.297114
H  5.494748 -2.042375 -1.296828
H  -6.391219 -3.075541 2.800761
H  -4.985123 -2.039078 3.255145
H  -4.858788 -3.174713 1.851966
H  6.391168 3.075832 2.800497
H  4.985075 2.039411 3.254985
H  4.858744 3.17489 1.851679
H  -8.987454 1.087448 -0.812864
H  -7.591744 1.198632 -1.952401
H  -7.711074 2.337044 -0.551157
H  8.987454 -1.087548 -0.812644
H  7.591753 -1.19887 -1.952179
H  7.711077 -2.337119 -0.550803
