program: Gaussian 09
title: 000291693
version: EM64L-G09RevD.01
frameworkgroup: C1[X(C13H19N5O4S)]
method: RPBEPBE
basis: SDD
operation: Freq
keyword: #p
keyword: freq=noraman
keyword: PBEPBE/SDD
title: #p freq=noraman PBEPBE/SDD
converged: YES YES NO NO
title: Mulliken charges:
elementType: S O O O O N N N N N C C C C C C C C C C C C C H H H H H H H H H H H H H H H H H H H
charge: 0.170900 -0.229038 -0.462107 -0.485789 -0.442925 -0.172482 -0.076326 -0.046455 -0.061474 -0.608872 -0.574644 -0.130285 -0.031890 -0.085583 -0.175343 -0.318305 0.175610 -0.202885 -0.575498 -0.113381 -0.651525 0.164305 -0.361474 0.312673 0.261875 0.235222 0.304657 0.229261 0.236183 0.183197 0.349176 0.266770 0.275910 0.266498 0.389039 0.236010 0.231407 0.231475 0.358701 0.246961 0.335679 0.344771
chargesum: 0.00000
title: Mulliken charges with hydrogens summed into heavy atoms:
elementType: S O O O O N N N N N C C C C C C C C C C C C C
charge: 0.170900 -0.229038 -0.112930 -0.096750 -0.084224 -0.172482 -0.076326 -0.046455 -0.061474 0.071578 -0.261971 0.131590 0.203333 0.219075 0.053918 0.101075 0.175610 0.063885 -0.033090 -0.113381 0.047367 0.164305 -0.114513
polarizability: 2.68417739e+02 1.15373068e+01 1.84365932e+02 -4.39821118e+00 1.61002527e+01 1.77063867e+02
1716.lowfreq: -11.2753 -7.4914 -3.4747 0.0008 0.0014 0.0015 7.0608 21.3933 34.6746
frequency: -3.1047 21.0886 34.6248 38.2556 50.7656 66.0880 90.5797 94.6661 104.6861 124.4946 138.3875 153.5970 188.4161 200.3907 205.5836 230.6457 243.0998 257.4007 272.6478 291.4740 303.8723 330.4967 343.8836 378.8559 429.2898 485.8498 496.0888 509.0901 510.2991 521.7034 548.7431 549.6111 560.1669 564.4976 570.5046 602.7090 613.9095 647.9273 666.0880 684.4163 695.3988 707.4164 731.8209 760.5780 785.3190 790.8837 806.9111 813.9754 826.2838 851.4218 864.9880 899.6610 929.7278 932.0403 958.6906 980.7039 989.4115 993.8414 1003.6001 1034.5166 1037.6677 1039.0110 1044.1839 1058.7918 1071.9033 1126.9818 1141.5727 1167.1638 1172.2105 1177.3998 1209.9121 1221.1777 1232.7036 1240.4564 1243.2200 1258.7781 1271.8560 1277.2375 1282.8322 1294.6390 1299.9245 1311.7253 1313.7805 1319.3649 1350.2364 1355.8961 1374.1283 1381.3884 1395.8431 1398.0314 1400.1911 1406.5560 1424.2470 1458.7398 1459.2814 1464.3331 1469.8305 1481.4717 1544.2911 1578.6166 1633.2141 2947.0493 2976.0398 2990.3547 2993.1324 3021.8246 3051.2480 3078.7558 3079.9103 3083.5824 3085.4441 3098.9899 3109.9086 3169.8609 3230.2839 3255.1478 3419.7325 3513.2229 3539.4191 3694.3176
redmass: 5.8644 4.7576 4.6421 5.1639 4.3220 2.3573 6.7829 4.9369 4.8429 3.8672 4.1971 6.8253 6.9291 6.3419 5.1816 1.7404 2.2722 4.1083 4.0488 5.4777 4.8724 5.4195 6.1695 3.9615 4.9549 4.2517 4.6498 8.3846 1.1749 1.2151 1.5715 1.8524 4.0090 3.2742 1.2102 6.2636 4.4351 4.8987 8.8770 4.7427 6.3568 1.1777 7.3904 4.4494 2.3502 1.1551 4.6587 2.8704 4.3734 7.7848 2.5047 4.8966 3.8154 1.4371 2.5881 4.5842 5.5789 1.8233 4.5417 3.0489 1.4288 2.1494 2.5118 3.1813 2.2795 4.0029 3.1327 1.3828 1.1991 1.7082 1.9649 1.6653 1.1993 1.2773 1.2929 2.1060 1.3414 1.3093 1.2706 1.2981 5.3500 1.3646 4.2305 1.2680 1.4173 2.2046 1.2968 3.0836 1.2951 1.3605 1.2011 1.3290 3.0221 1.7312 1.6464 1.0862 1.0386 1.0477 8.3669 1.8970 2.6702 1.0703 1.0826 1.0357 1.0856 1.0572 1.0866 1.0877 1.0906 1.1015 1.0988 1.0938 1.1069 1.0923 1.0976 1.0648 1.0651 1.0648 1.0444 1.1056
irintensity: 0.6755 0.1053 0.9802 0.4260 1.2828 2.6230 5.4770 4.8740 0.3397 0.3320 4.6845 9.0960 0.8941 9.9556 2.7587 2.0614 4.1609 3.8402 9.8483 8.9243 1.9989 2.3543 3.3955 7.5717 8.1612 1.6651 1.4087 7.2778 185.1012 275.3856 3.3070 4.6095 1.1241 16.7841 80.0334 11.2722 1.5715 53.1140 7.7527 14.3901 53.0818 175.1240 73.8856 6.8027 18.7580 4.2845 12.8753 0.7888 35.3492 3.7318 14.6507 22.5856 152.5657 13.9805 7.8492 107.9703 113.8324 20.5354 22.4677 48.3728 18.0782 19.3134 9.4079 105.3097 7.3566 13.4217 6.1789 38.3235 7.3250 61.7539 9.1370 158.4814 13.5993 12.6678 26.7604 63.8414 5.9668 48.8634 31.0677 6.2491 40.6708 30.6304 36.9661 13.4770 30.9042 74.0069 107.2136 11.1583 17.5086 23.7081 13.8396 12.1289 76.3723 12.8399 9.2799 4.5559 17.1955 9.4998 75.6521 41.6471 627.5120 48.3644 1.0821 27.0538 72.0963 13.3599 20.7146 13.8730 6.4071 5.1834 21.0814 16.4124 25.3560 15.1681 0.3888 176.9044 103.4962 14.2599 135.2611 50.0859
temp: 298.150 k
press: 1.00000 atm
elementType: 16 8 8 8 8 7 7 7 7 7 6 6 6 6 6 6 6 6 6 6 6 6 6 1 1 1 1 1 1 1 1 1 1 1 1 1 1 1 1 1 1 1
symmnumber: 1
zpe: 862573.9 jmol-1
zpe.correction: 0.328537 hartree
zpe.thermalcorrener: 0.350248 hartree
zpe.thermalcorrenthalpy: 0.351193 hartree
zpe.thermalcorrgfe: 0.276324 hartree
zpe.sumelectzpe: -1477.731119 hartree
zpe.sumelectthermal: -1477.709408 hartree
zpe.sumelectthermalent: -1477.708464 hartree
zpe.sumelectthermalfe: -1477.783332 hartree
dipole: -1.0045 5.7289 -4.4424
dipole: 7.3188
quadrupole: -140.3532 -145.7298 -150.1082
quadrupole: 24.9116 4.3482 4.4897
quadrupole: 5.0439 -0.3327 -4.7111 24.9116 4.3482 4.4897
hfenergy: -1478.0596563 hartree
pointgroup: C01 [X(C13H19N5O4S1)]
dipole: 0.8690668 -2.0100782 -1.8696132 debye
polarizability: 257.7725472|29.9420388|196.8017549|5.248425|-15.28674|175.273236 unknown
InChI: InChI=1S/C13H19N5O4S/c1-2-23-10-8(21)9(6(20)3-19)22-13(10)18-5-17-7-11(14)15-4-16-12(7)18/h4-6,8-10,13,19-21H,2-3,14H2,1H3
charge 0 multiplicity 1
42 atoms
S  -1.412188 -2.810921 0.698659
O  -1.092424 0.61979 0.86153
O  -3.322081 -1.332326 -1.001008
O  -4.497839 1.095486 -0.630259
O  -4.850551 2.754222 1.542222
N  1.033148 0.292952 -0.308901
N  2.254899 1.412244 -1.904689
N  2.771999 0.09115 1.455248
N  4.905411 1.109913 0.7736
N  5.223578 2.153124 -1.322143
C  -0.842561 -1.382429 -0.426663
C  -2.060554 -0.589591 -1.035984
C  -2.097177 0.758131 -0.228959
C  -0.078407 -0.340369 0.427802
C  -3.457958 1.079031 0.413369
C  -3.503945 2.476008 1.048796
C  2.313034 0.488904 0.236512
C  1.063456 0.874355 -1.593536
C  -1.421413 -4.213157 -0.599335
C  3.048046 1.176234 -0.763909
C  -1.993472 -5.484444 0.039942
C  4.404443 1.490058 -0.450125
C  4.080429 0.444762 1.639805
H  -0.20188 -1.833931 -1.199708
H  -1.891742 -0.392268 -2.107666
H  -1.796489 1.597299 -0.889378
H  0.376529 -0.756061 1.341494
H  -3.686356 0.316003 1.186266
H  -2.828742 2.530727 1.916904
H  -3.192273 3.229268 0.291878
H  -3.284729 -1.935816 -0.195114
H  0.201832 0.878825 -2.257452
H  -2.033357 -3.868582 -1.449268
H  -0.377303 -4.356416 -0.924958
H  -4.55935 0.158702 -0.972845
H  -1.396441 -5.802388 0.912708
H  -3.037428 -5.338155 0.368439
H  -1.980989 -6.307928 -0.697183
H  -5.468298 2.504848 0.803681
H  4.526662 0.162624 2.59774
H  6.181013 2.355254 -1.04127
H  4.869068 2.450068 -2.22874
