program: Gaussian 09
title: 000291625
version: EM64L-G09RevD.01
frameworkgroup: C1[X(C14H12N2O)]
method: RPBEPBE
basis: SDD
operation: Freq
keyword: #p
keyword: freq=noraman
keyword: PBEPBE/SDD
title: #p freq=noraman PBEPBE/SDD
converged: NO YES NO NO
title: Mulliken charges:
elementType: O N N C C C C C C C C C C C C C C H H H H H H H H H H H H
charge: -0.266981 0.003424 -0.011023 -0.110943 -0.079131 0.431232 0.235019 0.055374 0.052078 -0.410501 -0.367010 -0.797748 -0.334080 -0.327860 -0.219925 -0.220027 -0.493149 0.237911 0.254225 0.210731 0.241269 0.241350 0.263180 0.254981 0.234588 0.234053 0.234796 0.219557 0.234608
chargesum: 0.00000
title: Mulliken charges with hydrogens summed into heavy atoms:
elementType: O N N C C C C C C C C C C C C C C
charge: -0.266981 0.003424 -0.011023 -0.110943 -0.079131 0.431232 0.235019 0.055374 0.052078 -0.172590 -0.112785 -0.104398 -0.070900 -0.072879 0.014663 0.014026 0.195812
polarizability: 2.89674727e+02 -8.22903401e+00 2.03334642e+02 -1.48039739e-02 -1.16054482e-03 7.23818410e+01
1716.lowfreq: -12.7358 0.0003 0.0009 0.0009 3.3870 4.9135 7.7278 74.4345 98.4563
frequency: -12.5820 74.4324 98.4537 116.8700 141.0408 156.1189 218.6128 233.1410 247.0574 263.9730 306.2913 339.8758 350.9742 416.9436 426.1479 446.1653 482.1006 493.9157 499.7720 574.9608 592.8750 599.2556 618.4072 623.6623 669.2139 715.1006 764.0738 774.5708 783.0975 812.6703 843.0758 882.3977 897.5524 933.5065 945.5904 962.2934 973.5559 997.4191 1000.7295 1024.8026 1050.2373 1080.1705 1110.3405 1121.8800 1147.4184 1156.8416 1173.8445 1222.5392 1256.6745 1262.4511 1273.3803 1281.2377 1315.6846 1373.6849 1391.2442 1402.9457 1406.7786 1440.2348 1450.7478 1453.3262 1454.7288 1460.1058 1468.0101 1478.2117 1489.8427 1529.5491 1574.9877 1587.7293 1622.8213 2982.9540 2996.6566 3065.2435 3085.3523 3107.5292 3117.4536 3132.1116 3132.6924 3144.5128 3159.5388 3165.5598 3170.1450
redmass: 3.0392 4.3308 4.3491 2.8907 1.1606 4.3773 1.1605 3.1353 4.2937 4.4772 3.7555 4.0721 4.8521 5.0438 5.7468 5.2155 3.7574 6.5494 3.4579 5.4937 3.7567 8.1167 4.9058 5.5454 8.7309 5.9105 3.9037 1.3219 6.1079 3.5433 1.4762 1.7384 6.3945 7.2855 1.3698 2.1180 1.3447 1.3233 2.1660 3.8220 1.5231 2.0055 1.2423 1.6038 1.3654 1.2343 1.8110 2.0959 2.3000 4.1452 2.8158 3.1527 4.2658 2.2028 3.3957 1.4649 3.8198 1.4050 1.0531 1.0656 1.0458 2.0974 2.7830 1.4213 6.7600 6.9351 7.3307 5.3320 6.5621 1.0359 1.0279 1.0968 1.1007 1.1045 1.1059 1.0857 1.0893 1.0889 1.0961 1.0942 1.1007
irintensity: 6.2417 1.0744 4.7122 0.2361 0.7769 0.3636 0.0398 5.2670 1.3240 0.0102 5.7403 0.9078 0.8367 3.2286 5.7075 0.5953 1.0495 2.6427 0.1492 0.0836 3.4880 5.0617 12.2652 3.1467 4.2588 12.1454 1.8070 97.6555 1.5649 1.6800 42.7382 0.0951 2.2156 19.6520 0.5550 1.5200 2.0211 0.0235 9.0420 31.9733 6.7883 83.1797 0.1594 15.6352 0.7323 10.5594 35.5260 8.4098 42.5476 54.8231 19.2989 19.0644 29.0293 32.5072 25.4166 22.2971 8.7387 30.6970 11.7633 40.5262 13.3451 31.8765 90.5872 36.3638 2.9468 11.9968 46.9174 10.1950 2.1883 39.1374 54.1752 15.7866 20.6804 30.3317 42.2884 4.6067 19.9462 4.5998 16.2888 12.4478 32.2937
temp: 298.150 k
press: 1.00000 atm
elementType: 8 7 7 6 6 6 6 6 6 6 6 6 6 6 6 6 6 1 1 1 1 1 1 1 1 1 1 1 1
symmnumber: 1
zpe: 589747.6 jmol-1
zpe.correction: 0.224623 hartree
zpe.thermalcorrener: 0.237810 hartree
zpe.thermalcorrenthalpy: 0.238754 hartree
zpe.thermalcorrgfe: 0.185403 hartree
zpe.sumelectzpe: -724.224144 hartree
zpe.sumelectthermal: -724.210957 hartree
zpe.sumelectthermalent: -724.210013 hartree
zpe.sumelectthermalfe: -724.263365 hartree
dipole: -1.4489 0.7336 0.0020
dipole: 1.6240
quadrupole: -85.0078 -89.6738 -102.6802
quadrupole: -4.7153 -0.0030 0.0066
quadrupole: 7.4461 2.7801 -10.2263 -4.7153 -0.0030 0.0066
hfenergy: -724.4487674 hartree
pointgroup: C01 [X(C14H12N2O1)]
dipole: 0.5523075 -0.3205598 -0.0207139 debye
polarizability: 288.4280791|-13.1273164|204.0446665|-1.2570663|8.399143|72.918465 unknown
InChI: InChI=1S/C14H12N2O/c1-9-7-8-12(17-2)14-13(9)15-10-5-3-4-6-11(10)16-14/h3-8H,1-2H3
charge 0 multiplicity 1
29 atoms
O  -2.768374 -2.169923 -0.270932
N  0.551768 1.584927 -0.03881
N  0.07951 -1.248772 -0.218821
C  -0.728648 1.088328 -0.067769
C  -0.967061 -0.368525 -0.16022
C  -1.825528 2.021962 -0.006283
C  -2.340911 -0.846104 -0.187866
C  1.589039 0.695513 -0.097878
C  1.350933 -0.742596 -0.189233
C  -3.119765 1.492864 -0.038016
C  -3.377962 0.09284 -0.126492
C  -1.5545 3.507349 0.088314
C  2.94177 1.180844 -0.069591
C  2.47212 -1.639443 -0.248184
C  4.005538 0.284806 -0.128517
C  3.769522 -1.135158 -0.21829
C  -1.860023 -3.326979 -0.345518
H  -3.97702 2.174721 0.006397
H  -4.40642 -0.280812 -0.148327
H  -2.500648 4.075619 0.124824
H  -0.959621 3.747381 0.988251
H  -0.959965 3.859813 -0.773992
H  3.091199 2.263065 -0.001056
H  2.265476 -2.712525 -0.315586
H  5.03735 0.652882 -0.107223
H  4.626661 -1.816281 -0.262803
H  -1.218647 -3.275741 -1.240514
H  -2.547006 -4.187246 -0.399832
H  -1.217285 -3.389908 0.547766
