program: Gaussian 09
title: 000291569
version: EM64L-G09RevD.01
frameworkgroup: C1[X(C7H8N2O2)]
method: RPBEPBE
basis: SDD
operation: Freq
keyword: #pfreq=noraman
keyword: PBEPBE/SDD
title: #p freq=noraman PBEPBE/SDD
converged: YES YES NO NO
title: Mulliken charges:
elementType: O O N N C C C C C C C H H H H H H H H
charge: -0.263670 -0.247250 -0.388191 -0.599180 0.371876 -0.614811 -0.389528 0.068356 -0.144663 0.206399 -0.287273 0.268829 0.256635 0.338879 0.249589 0.237328 0.252000 0.340509 0.344166
chargesum: 0.00000
title: Mulliken charges with hydrogens summed into heavy atoms:
elementType: O O N N C C C C C C C
charge: -0.263670 -0.247250 -0.049311 0.085494 0.371876 -0.089347 -0.139939 0.068356 0.092664 0.206399 -0.035273
polarizability: 1.25165799e+02 -7.92845512e-01 9.90524503e+01 -1.27161751e+01 2.17843490e+00 6.30729758e+01
1716.lowfreq: -9.3952 -5.5898 -2.7187 -0.0010 -0.0010 -0.0008 37.1866 42.0949 85.8234
frequency: 37.1494 42.0693 85.8216 173.8557 235.5496 285.4361 350.6065 418.9265 458.9364 483.7777 517.2013 526.8221 557.8826 577.5805 634.3138 663.3688 704.1363 755.3673 761.8823 793.9955 839.4651 868.6510 892.8851 946.1864 984.4431 994.2506 1055.2222 1063.9169 1148.7600 1171.3906 1204.8455 1230.6806 1275.5144 1335.6986 1341.8424 1398.6349 1437.8464 1454.3544 1549.8701 1586.2782 1603.3196 1655.1841 1659.7114 3019.9296 3080.4680 3139.1412 3175.0760 3187.5897 3491.2937 3505.4998 3659.7438
redmass: 5.4888 5.2949 5.1993 5.6042 4.2873 2.9836 5.6930 3.0920 3.3693 2.4976 2.1939 7.7720 2.1012 1.6583 2.6853 1.9500 2.3284 4.2047 1.3088 1.9122 2.8299 1.6749 2.6555 2.7830 1.3079 4.1446 1.9277 1.8351 1.4154 1.1375 1.8557 2.1591 1.7639 2.6954 1.3773 2.2372 2.7022 1.2001 6.9820 1.4377 3.6425 4.8949 6.1910 1.0606 1.1013 1.0891 1.0935 1.0971 1.0772 1.0451 1.1043
irintensity: 4.7156 6.8556 2.9293 3.4022 6.3128 1.1738 10.6997 7.8817 6.8627 5.7355 10.9412 2.4054 54.2706 132.0007 20.2557 56.9827 32.6157 13.6971 7.4378 91.0749 20.3885 1.6538 10.6875 3.2669 0.8950 11.7577 2.4064 3.0269 37.9749 4.0255 3.5440 6.5622 66.0264 101.3671 5.7663 6.0656 11.1326 15.3451 36.5936 170.9287 201.1012 310.3161 368.5444 7.1985 2.9658 16.0635 4.2944 3.0597 37.7554 27.1877 54.6014
temp: 298.150 k
press: 1.00000 atm
elementType: 8 8 7 7 6 6 6 6 6 6 6 1 1 1 1 1 1 1 1
symmnumber: 1
zpe: 382938.8 jmol-1
zpe.correction: 0.145854 hartree
zpe.thermalcorrener: 0.155775 hartree
zpe.thermalcorrenthalpy: 0.156720 hartree
zpe.thermalcorrgfe: 0.109126 hartree
zpe.sumelectzpe: -530.720064 hartree
zpe.sumelectthermal: -530.710143 hartree
zpe.sumelectthermalent: -530.709198 hartree
zpe.sumelectthermalfe: -530.756792 hartree
dipole: 0.4591 4.9243 0.9797
dipole: 5.0417
quadrupole: -84.4661 -66.5520 -58.6008
quadrupole: -5.5741 3.8509 2.0488
quadrupole: -14.5931 3.3209 11.2722 -5.5741 3.8509 2.0488
hfenergy: -530.8659181 hartree
pointgroup: C01 [X(C7H8N2O2)]
dipole: -0.3307637 -1.7486181 0.8760575 debye
dipolederiv: -0.6739005 -0.32836 0.0210811 -0.6069225 -1.1192705 0.0602676 0.0961289 0.129602 -0.3946473 -1.0214551 0.2358094 -0.3257904 0.3871068 -0.4931218 0.1604306 -0.1416448 0.0330296 -0.6763998 -0.6589721 -0.5115024 0.0621404 0.0839206 -0.4856117 0.1392719 -0.1969933 -0.1413407 -0.2551533 -0.5007224 -0.1283465 -0.0204325 -0.106103 -0.53915 -0.0130415 -0.0381576 0.0516785 -1.053208 0.4121345 0.1576035 -0.000983 -0.3432434 0.5177814 -0.3325576 0.3216249 -0.1673727 0.1116071 -0.3349576 0.1379954 0.0616903 0.3036877 -0.0380632 -0.0706684 0.1931547 -0.1042404 -0.017274 -0.5926412 0.0113449 -0.0615217 0.3526496 -0.1794832 0.0907321 -0.2457162 0.0186621 -0.3374121 0.8306331 0.5620812 0.0415345 0.8226817 1.2851159 -0.1128178 -0.0260568 -0.1538805 0.2488051 0.5652753 0.1159857 0.1738939 0.1549818 0.238738 -0.0724214 0.2142433 -0.057848 0.0338696 1.205981 -0.4346137 0.2799216 -0.6489755 0.4546857 -0.0629612 0.01637 0.0130056 1.3776895 -0.0803604 0.0852333 0.0420567 -0.422935 -0.5207088 -0.0089262 0.1975818 0.1578633 -0.1642256 0.0394241 -0.0078382 -0.004566 -0.057803 -0.0417569 -0.0394252 -0.0064373 0.0225668 0.1085199 0.0194926 0.0080759 0.0067049 -0.0037138 0.0762646 0.0971283 -0.0356625 0.0582128 -0.013844 0.1943762 -0.0249939 -0.0484008 -0.0020275 0.1902396 0.0252979 -0.0501172 0.0243622 0.2638282 0.0360272 -0.095929 -0.034879 -0.092487 0.0137953 0.020387 -0.0420824 0.0088168 0.152111 0.0679644 0.0522244 -0.0485887 0.0724458 -0.0347159 0.0927136 -0.056631 0.0891569 0.089338 -0.0056578 -0.0051362 -0.0767496 -0.0350651 0.0912866 0.0163125 -0.06794 0.0299453 0.1331117 0.2167605 0.0875462 -0.0174804 0.096551 0.3142799 -0.0093651 -0.0168271 -0.0164872 0.1968964 0.2805982 0.0828198 -0.0496313 0.0452508 0.269695 0.0196431 -0.1148375 0.0042676 0.1963876 unknown
polarizability: 122.2043157|2.9704491|95.0022424|17.8092807|-11.5552257|70.0846665 unknown
InChI: InChI=1S/C7H8N2O2/c8-6(10)4-5-2-1-3-7(11)9-5/h1-3,9H,4,8H2
charge 0 multiplicity 1
19 atoms
O  2.479529 2.11778 -0.360694
O  -3.67144 1.045685 -0.991891
N  0.554104 0.842962 -0.748204
N  -2.479782 0.500861 0.929506
C  -0.21932 -0.30571 -0.66824
C  -1.60364 -0.251967 -1.271865
C  0.304377 -1.416998 -0.012548
C  1.878674 1.009548 -0.215131
C  1.625923 -1.34156 0.550223
C  -2.675155 0.503639 -0.436903
C  2.384699 -0.183286 0.458495
H  -1.979762 -1.27942 -1.422892
H  -1.597224 0.232644 -2.264453
H  0.185598 1.673913 -1.225695
H  -0.283743 -2.336044 0.045101
H  2.038878 -2.221337 1.056757
H  3.391632 -0.111711 0.877884
H  -3.168199 0.965687 1.521021
H  -1.65805 0.070113 1.353731
