program: Gaussian 09
title: 000291583
version: EM64L-G09RevD.01
frameworkgroup: C1[X(C11H13BrO3)]
method: RPBEPBE
basis: SDD
operation: Freq
keyword: #p
keyword: freq=noraman
keyword: PBEPBE/SDD
title: #p freq=noraman PBEPBE/SDD
converged: YES YES NO NO
title: Mulliken charges:
elementType: Br O O O C C C C C C C C C C C H H H H H H H H H H H H H
charge: -0.011871 -0.259064 -0.262522 -0.234312 0.159756 0.118106 0.224280 0.215974 -0.311029 -0.419341 -0.784182 0.180138 -0.810426 -0.529110 -0.533902 0.241275 0.245152 0.235126 0.242340 0.252174 0.285367 0.318484 0.229600 0.281522 0.225805 0.248857 0.226167 0.225635
chargesum: 0.00000
title: Mulliken charges with hydrogens summed into heavy atoms:
elementType: Br O O O C C C C C C C C C C C
charge: -0.011871 -0.259064 -0.262522 -0.234312 0.159756 0.118106 0.224280 0.215974 -0.069754 -0.174189 -0.054542 0.180138 -0.206575 0.207818 0.166757
polarizability: 2.01545302e+02 -1.70478114e+01 1.65383813e+02 -8.30866779e+00 -2.19952995e-01 1.01375361e+02
1716.lowfreq: -9.4971 -7.5290 0.0007 0.0010 0.0010 6.2203 26.9325 40.0994 67.8597
frequency: 26.8722 40.0497 67.8561 86.9720 100.8966 109.0392 139.3698 157.8066 176.7558 179.5899 221.6435 237.8857 266.0701 285.0636 305.8889 321.2871 345.0783 367.6436 431.7209 464.2067 480.6316 509.2875 557.1184 612.2714 629.3188 633.7171 693.8785 695.0861 774.0157 793.1300 815.8005 876.8546 903.2435 926.2718 973.8380 991.7397 1044.0160 1069.9084 1107.5227 1110.3051 1112.0070 1130.9791 1148.4602 1152.3829 1202.1561 1221.0683 1227.7939 1256.3972 1285.7950 1381.5192 1397.8351 1402.0133 1430.7644 1438.0871 1442.6564 1451.6991 1457.8026 1468.8319 1469.8782 1472.1280 1474.7011 1483.8617 1540.8386 1569.3564 1607.6399 2967.9849 2980.9717 2995.6300 3059.8913 3060.0059 3068.5534 3091.2827 3119.9400 3127.2965 3129.5094 3154.8048 3158.9504 3179.4779
redmass: 5.9132 7.2475 3.4857 4.2348 1.0632 4.5807 3.8262 3.4960 1.8199 2.1999 2.1422 1.6826 2.3747 3.3509 4.5984 4.6889 3.1724 4.3683 4.8515 6.3203 5.3201 3.6929 4.5687 4.4469 4.4563 4.0255 4.5705 4.3405 3.6466 1.9595 4.3936 2.5699 2.9491 1.3857 6.3089 2.2112 1.4920 1.4631 2.0363 1.2797 1.4777 2.1794 1.3902 1.5257 1.7652 1.2454 1.9513 4.2503 3.3194 3.4049 1.2320 3.6712 1.2382 1.1872 1.2356 1.1462 1.3340 1.1224 1.0532 1.0849 1.0999 1.6967 6.6423 7.6241 6.4970 1.0325 1.0312 1.0382 1.0598 1.1029 1.0964 1.1011 1.1051 1.0987 1.1001 1.1003 1.0936 1.0961
irintensity: 0.4690 1.5630 3.6207 2.7115 0.3415 3.1129 2.2833 9.0736 2.1648 2.6428 3.0163 4.6322 1.0318 3.8613 0.4149 0.4896 7.9776 2.9192 1.4233 11.5233 21.7704 13.5715 25.3226 20.5100 10.2611 32.5080 1.7048 3.3209 20.1137 28.7070 2.9044 0.4808 4.1511 0.0545 5.6935 10.4226 2.1690 23.4765 206.1028 19.1663 112.9288 3.7755 12.5169 5.4568 2.6808 22.9724 63.3065 232.1370 108.8252 87.1937 6.5518 8.3322 52.0716 2.7380 54.7453 18.5185 4.2130 54.4230 20.2585 51.5414 18.4041 44.5218 217.5581 75.0164 259.3129 70.5723 45.0539 19.2745 4.3271 43.7528 16.5808 20.3817 19.8273 8.1601 20.5204 4.5311 1.2230 10.6301
temp: 298.150 k
press: 1.00000 atm
elementType: 35 8 8 8 6 6 6 6 6 6 6 6 6 6 6 1 1 1 1 1 1 1 1 1 1 1 1 1
symmnumber: 1
zpe: 567332.6 jmol-1
zpe.correction: 0.216086 hartree
zpe.thermalcorrener: 0.232283 hartree
zpe.thermalcorrenthalpy: 0.233227 hartree
zpe.thermalcorrgfe: 0.170710 hartree
zpe.sumelectzpe: -664.939310 hartree
zpe.sumelectthermal: -664.923113 hartree
zpe.sumelectthermalent: -664.922169 hartree
zpe.sumelectthermalfe: -664.984686 hartree
dipole: 2.3109 -3.2676 -0.3754
dipole: 4.0198
quadrupole: -94.7706 -90.0010 -98.6028
quadrupole: -9.9111 -1.9355 -9.1929
quadrupole: -0.3125 4.4571 -4.1446 -9.9111 -1.9355 -9.1929
hfenergy: -665.155396 hartree
pointgroup: C01 [X(C11H13Br1O3)]
dipole: 1.2345805 -0.8901583 -0.4296251 debye
polarizability: 208.2687137|-5.8155595|151.0814404|1.354526|20.3086761|108.9543217 unknown
InChI: InChI=1S/C11H13BrO3/c1-7-10(14-2)5-4-8(9(13)6-12)11(7)15-3/h4-5H,6H2,1-3H3
charge 0 multiplicity 1
28 atoms
Br -3.110982 -1.512571 -2.281458
O  -0.33717 2.251426 0.249528
O  3.601522 -0.286405 -0.3417
O  -2.655388 0.485224 1.042159
C  1.574635 0.924474 -0.008318
C  0.152067 0.964555 0.046017
C  -0.644517 -0.227274 -0.120326
C  2.203426 -0.313547 -0.30192
C  0.047599 -1.422803 -0.480783
C  1.44078 -1.484216 -0.57159
C  2.378512 2.189905 0.196945
C  -2.074112 -0.323405 0.247716
C  -2.923405 -1.499558 -0.252714
C  -1.626435 2.693974 -0.309838
C  4.308815 -1.516599 -0.713288
H  -0.52212 -2.337215 -0.666472
H  1.924952 -2.429384 -0.82897
H  2.026116 2.986285 -0.482308
H  2.245346 2.577613 1.223442
H  3.448402 2.005188 0.022832
H  -2.521408 -2.490966 0.007128
H  -3.94521 -1.378688 0.131487
H  -1.493839 3.770925 -0.498446
H  -2.433901 2.51052 0.415986
H  -1.848879 2.164274 -1.25517
H  5.374871 -1.248002 -0.691413
H  4.027682 -1.849722 -1.730396
H  4.11294 -2.326604 0.014774
