program: Gaussian 09
title: 000291574
version: EM64L-G09RevD.01
frameworkgroup: C1[X(C10H11BrO2)]
method: RPBEPBE
basis: SDD
operation: Freq
keyword: #p
keyword: freq=noraman
keyword: PBEPBE/SDD
title: #p freq=noraman PBEPBE/SDD
converged: YES YES NO NO
title: Mulliken charges:
elementType: Br O O C C C C C C C C C C H H H H H H H H H H H
charge: -0.007941 -0.284427 -0.246933 0.176521 0.389232 -0.294900 -0.336886 -0.706458 -0.383091 -0.354604 -0.218254 -0.221425 -0.236072 0.226390 0.221624 0.240153 0.230190 0.298235 0.291704 0.260505 0.272489 0.226682 0.228009 0.229258
chargesum: 0.00000
title: Mulliken charges with hydrogens summed into heavy atoms:
elementType: Br O O C C C C C C C C C C
charge: -0.007941 -0.284427 -0.246933 0.176521 0.389232 0.153113 0.133457 -0.116519 -0.122585 -0.082115 0.008428 0.006584 -0.006814
polarizability: 1.23259328e+02 1.09222562e+01 1.31679235e+02 8.59886826e+00 -1.31708201e+01 1.08012969e+02
1716.lowfreq: -10.4001 -4.6952 0.0002 0.0005 0.0005 14.4904 37.7012 42.8896 58.5723
frequency: 37.6727 42.7864 58.5068 92.1487 141.7073 176.4858 220.9960 247.3357 293.1696 329.4285 404.4178 444.5256 469.2384 568.9049 612.6007 623.2684 637.2013 659.0813 708.2483 715.6282 767.1096 808.5403 849.6087 859.4865 878.5050 915.4433 933.3349 958.0581 971.1448 983.0290 990.2264 999.1793 1003.0522 1030.0901 1081.7039 1095.6269 1127.4484 1160.7756 1172.1494 1172.9639 1186.3871 1200.1064 1232.8497 1265.8264 1313.8346 1317.0125 1327.7789 1382.0479 1419.1672 1434.2475 1468.4390 1478.0787 1480.0678 1592.2982 1611.8191 3002.8356 3010.0757 3071.6563 3081.5783 3117.1054 3124.8462 3135.4411 3149.7029 3159.3685 3164.6935 3168.7477
redmass: 5.1424 3.2080 5.0791 4.3988 3.4374 4.3282 2.7776 9.9731 3.2159 5.8883 2.8601 5.8257 3.6228 4.4611 5.6527 3.1856 4.7979 5.4981 1.7923 6.0386 1.8812 2.3102 2.0213 1.2991 4.4084 3.2237 1.4226 2.3319 3.2462 1.4356 5.2075 1.3256 4.7180 2.0723 1.5846 1.6456 1.7760 1.2724 1.0561 2.0470 1.1186 1.2732 1.3234 2.7345 1.2990 1.2931 1.2364 9.2164 1.1052 2.1990 1.0916 2.0820 1.1439 6.3273 6.0656 1.0660 1.0589 1.0559 1.1065 1.1026 1.0848 1.0886 1.0930 1.0959 1.1113 1.1003
irintensity: 0.1321 5.0953 0.8237 2.5506 0.8665 3.7545 3.0453 2.3531 1.7002 6.9972 0.0403 2.6499 6.5205 22.5542 0.4371 22.9262 41.9884 10.5603 53.6875 22.8484 34.7768 6.7412 4.9199 1.1160 24.4463 69.7316 6.3966 16.1721 17.1455 0.2502 0.8461 1.2023 99.8086 11.1333 7.2461 5.5471 32.3608 5.5391 0.2385 43.5206 5.1727 0.7456 14.8631 86.8042 5.5566 6.2764 0.4447 0.3725 12.9285 11.6096 8.0886 4.4745 2.1902 0.5069 0.0146 37.6466 76.4413 6.5269 24.6464 30.1295 0.0474 11.3961 20.6922 17.8832 3.5822 12.4433
temp: 298.150 k
press: 1.00000 atm
elementType: 35 8 8 6 6 6 6 6 6 6 6 6 6 1 1 1 1 1 1 1 1 1 1 1
symmnumber: 1
zpe: 491287.4 jmol-1
zpe.correction: 0.187121 hartree
zpe.thermalcorrener: 0.199094 hartree
zpe.thermalcorrenthalpy: 0.200038 hartree
zpe.thermalcorrgfe: 0.146580 hartree
zpe.sumelectzpe: -550.580303 hartree
zpe.sumelectthermal: -550.568331 hartree
zpe.sumelectthermalent: -550.567387 hartree
zpe.sumelectthermalfe: -550.620845 hartree
dipole: -2.3888 2.6803 0.2895
dipole: 3.6020
quadrupole: -85.2511 -75.3755 -82.5879
quadrupole: 4.0756 -1.6239 1.3726
quadrupole: -4.1796 5.6960 -1.5164 4.0756 -1.6239 1.3726
hfenergy: -550.7674249 hartree
pointgroup: C01 [X(C10H11Br1O2)]
dipole: -0.2286147 -1.3861827 -0.1856602 debye
dipolederiv: -0.1475429 -0.1070973 -0.0468151 -0.0615151 -0.4380218 -0.1053991 -0.0678607 -0.1971065 -0.1997215 -0.8164687 -0.2994274 -0.156986 -0.3418957 -0.8401048 -0.1455546 -0.0974298 0.0346175 -0.4515108 -0.7134287 -0.1768967 0.0623786 -0.2013882 -0.6792678 0.0866685 0.0959839 0.1508996 -0.5074739 1.1623864 0.0354577 0.0119741 0.1617832 0.8426186 0.0075265 0.0535398 -0.3059544 0.45615 -0.1248051 -0.0704567 -0.0091948 -0.0468335 -0.1625505 -0.0017561 0.0295459 0.0173534 -0.0859652 0.5996861 0.2768834 0.0781399 0.2151687 0.4113562 0.0885513 -0.156719 -0.1623715 0.0703812 0.3464847 0.0014776 -0.0128101 0.1414123 0.4833413 -0.1053654 0.045226 0.0274523 0.1720261 -0.0367826 0.3335702 0.0935412 0.0911553 0.4867723 0.2671932 0.1040597 0.4659502 0.2615845 -0.0673047 -0.0132651 0.0899756 0.008769 -0.1363899 0.0223245 -0.0188464 0.0291627 0.0252963 -0.066581 -0.0365434 -0.0858913 -0.0349842 -0.0815329 0.0646454 -0.0058626 0.0208376 -0.008587 -0.0215877 -0.0504178 -0.1046198 -0.0447631 -0.1222493 0.0574876 -0.0943138 0.0600585 0.0456621 -0.0518391 0.0009006 0.104458 0.0045379 -0.1408385 0.0261357 0.0827557 0.0172206 0.1007125 0.0897692 -0.0590661 0.0275793 -0.0499813 -0.1419129 0.0103572 0.0247443 0.012274 -0.0369555 0.0489125 0.0129725 0.0229277 -0.0459846 -0.1631983 -0.0842935 0.0055413 -0.0502435 0.072324 -0.2200621 -0.0440826 -0.0713927 0.0292436 0.0387023 0.0253887 -0.0150888 0.0262378 0.0487521 -0.0504394 -0.0641536 0.1025251 -0.0253495 0.0631606 0.0177195 0.0967759 0.0521478 0.029537 -0.0350346 0.1282948 -0.0784125 0.0602954 -0.0842017 0.0327703 -0.0576532 0.0055993 0.0257108 -0.0710806 0.0162075 -0.0489163 0.0179002 -0.0158724 -0.0482566 -0.0578413 -0.0691075 0.0591936 0.0800907 -0.0525866 0.0448133 -0.0401572 0.0002906 -0.0816557 0.0462311 -0.0228405 -0.0440166 0.1002995 0.006976 -0.0779321 0.003621 0.1398193 -0.0144115 -0.0620038 -0.0064677 -0.0186836 0.0773323 0.0312338 0.07161 0.0324221 0.1180476 -0.0403026 0.0734816 -0.032961 0.0260961 0.0005177 0.0484075 0.087173 0.051739 0.1338552 -0.0550858 0.1007301 -0.0566135 -0.0413523 0.0390551 0.0172347 -0.0725993 0.0100573 0.1475662 -0.0220422 -0.0912802 -0.013978 -0.087403 -0.121577 0.064377 -0.0315259 0.0647473 0.1406109 -0.0026453 -0.0337157 -0.0021674 0.0882431 unknown
polarizability: 137.6251816|-1.1751408|109.866934|7.8520062|15.2334703|115.4594161 unknown
InChI: InChI=1S/C10H11BrO2/c11-8-10(12-6-7-13-10)9-4-2-1-3-5-9/h1-5H,6-8H2
charge 0 multiplicity 1
24 atoms
Br -0.660347 3.245128 0.559843
O  -1.611389 -0.445278 -1.374423
O  -1.878248 0.103486 0.907631
C  -1.050409 0.399048 -0.263957
C  0.418862 0.038056 -0.041836
C  -2.511041 -1.453851 -0.750926
C  -2.227264 -1.328936 0.761349
C  -1.335108 1.836335 -0.719618
C  1.232436 -0.33128 -1.140772
C  0.980163 0.103605 1.256562
C  2.59759 -0.633823 -0.941687
C  2.344769 -0.204555 1.453744
C  3.157243 -0.571386 0.35615
H  -2.2534 -2.443738 -1.163794
H  -3.556095 -1.196146 -1.000354
H  -3.101564 -1.512888 1.402665
H  -1.375788 -1.96346 1.073095
H  -2.420099 1.994016 -0.790139
H  -0.831816 2.040275 -1.675291
H  0.785851 -0.403455 -2.13804
H  0.343628 0.397333 2.097248
H  3.221935 -0.922086 -1.794895
H  2.773916 -0.15273 2.460637
H  4.216373 -0.806968 0.510305
