program: Gaussian 09
title: 000027979
version: EM64L-G09RevD.01
frameworkgroup: C1[X(C8H15NO2)]
method: RPBEPBE
basis: SDD
operation: Freq
keyword: #p
keyword: freq=noraman
keyword: PBEPBE/SDD
title: #p freq=noraman PBEPBE/SDD
converged: YES YES NO NO
title: Mulliken charges:
elementType: O O N C C C C C C C C H H H H H H H H H H H H H H H
charge: -0.280656 -0.271697 -0.385504 -0.074692 -0.241725 -0.689887 -0.701462 -0.231759 0.260367 -0.212393 -0.482801 0.211526 0.187103 0.185551 0.249977 0.207125 0.196787 0.221726 0.210341 0.206470 0.245698 0.197411 0.310221 0.207941 0.222591 0.251743
chargesum: 0.00000
title: Mulliken charges with hydrogens summed into heavy atoms:
elementType: O O N C C C C C C C C
charge: -0.280656 -0.271697 -0.075284 0.136834 0.130929 -0.035998 -0.062924 0.211350 0.260367 -0.004452 -0.008468
polarizability: 1.42922805e+02 -1.86972396e+01 8.40646057e+01 -1.39572269e+00 4.43559557e+00 8.72994502e+01
1716.lowfreq: -4.0026 0.0004 0.0007 0.0008 5.5657 11.2986 26.6243 41.4346 51.5779
frequency: 26.2406 39.1609 51.5751 86.9733 110.9752 138.3648 161.9588 200.2563 218.0420 231.7220 253.9992 310.7979 330.4831 372.1316 422.0700 466.2066 502.5242 555.9055 604.0547 644.6079 785.4427 825.3687 846.1328 905.7098 921.2321 931.2245 954.2438 970.5778 983.4223 995.7343 1019.5709 1046.9107 1079.6977 1105.6724 1140.5172 1151.7620 1189.9291 1214.3889 1229.4193 1236.0996 1295.1407 1310.0678 1341.1320 1350.9384 1376.2023 1388.5758 1402.7106 1410.0442 1462.6251 1467.6606 1469.7029 1479.9872 1481.4875 1490.2257 1492.6823 1608.9291 1651.8403 2907.8521 2936.8632 2957.1885 2969.6120 2974.9644 2993.3062 3026.6239 3060.6624 3067.8266 3075.0772 3095.3856 3095.7210 3112.2796 3218.6797 3554.6428
redmass: 4.4184 2.8004 4.9734 3.3642 2.6730 2.7867 2.8423 1.0729 2.5897 1.1140 3.5689 2.8851 3.5029 2.5868 1.9860 2.7210 2.2245 1.6980 2.0322 2.9759 3.6917 2.6216 2.9753 1.7984 1.2760 1.9125 1.7232 1.7613 1.2729 1.1682 7.7053 1.5027 2.1639 2.9930 2.0108 1.7459 1.7698 2.1230 1.2081 1.1607 1.3215 1.4479 1.3981 1.3364 1.2078 1.2344 1.2377 1.2848 1.0767 1.0851 1.0520 1.0940 1.1432 1.0953 1.4692 6.7526 4.6762 1.0543 1.0633 1.1028 1.0356 1.0376 1.0868 1.0989 1.0993 1.0989 1.0988 1.0991 1.0661 1.0873 1.1163 1.0773
irintensity: 1.6708 1.6026 7.9236 2.4507 0.8279 8.4533 1.1002 0.6697 2.4758 0.0402 1.2461 6.1889 9.8410 4.1848 1.7785 6.8585 8.5006 55.3542 65.4492 11.3586 27.4620 2.0214 5.2087 28.7550 4.8979 16.1053 12.8117 9.3248 0.4644 90.6173 322.1852 5.0642 5.0496 2.5535 7.7725 2.0817 5.3150 153.3879 9.4179 55.7561 2.9508 21.9645 3.3094 8.1362 18.6808 23.4141 25.4030 16.7463 9.1617 11.1046 0.2604 17.2190 72.2372 62.6921 174.9574 102.3466 26.0237 56.8343 99.8720 38.5787 40.6229 24.6051 36.8565 8.8734 22.7600 62.5893 61.0006 26.4924 9.3126 14.5358 7.6382 18.7900
temp: 298.150 k
press: 1.00000 atm
elementType: 8 8 7 6 6 6 6 6 6 6 6 1 1 1 1 1 1 1 1 1 1 1 1 1 1 1
symmnumber: 1
zpe: 578919.3 jmol-1
zpe.correction: 0.220499 hartree
zpe.thermalcorrener: 0.233991 hartree
zpe.thermalcorrenthalpy: 0.234935 hartree
zpe.thermalcorrgfe: 0.178894 hartree
zpe.sumelectzpe: -518.135311 hartree
zpe.sumelectthermal: -518.121819 hartree
zpe.sumelectthermalent: -518.120874 hartree
zpe.sumelectthermalfe: -518.176916 hartree
dipole: 0.6840 -1.6872 -2.6784
dipole: 3.2386
quadrupole: -59.4536 -66.2440 -68.4585
quadrupole: -2.6094 9.8440 0.5273
quadrupole: 5.2651 -1.5253 -3.7398 -2.6094 9.8440 0.5273
hfenergy: -518.3558094 hartree
pointgroup: C01 [X(C8H15N1O2)]
dipole: 0.2731612 0.8135646 0.9417937 debye
dipolederiv: -1.4476504 0.0732637 0.0003525 0.313684 -0.4632908 -0.0111067 -0.0243281 0.0391129 -0.3789057 -0.6587603 -0.0809917 0.0794614 -0.178786 -0.4677246 -0.143182 -0.1055225 -0.1913891 -0.8691679 -1.4313364 -0.2570531 -0.21011 -0.4131514 -0.7336587 -0.1238685 0.0086311 0.0290122 -0.3103885 0.0455228 0.0029284 0.0045302 -0.0155978 0.1106974 0.001752 0.0471203 0.0176497 0.136638 0.8217047 0.0145172 -0.0789066 0.1146266 0.3216824 0.0885296 -0.2614709 0.0797662 0.3316542 -0.0347976 -0.0432862 0.0087146 -0.0486512 -0.0804319 0.0042 -0.0165699 0.0155884 0.0906612 -0.083322 -0.0189784 0.0288162 0.0370849 0.0358449 0.0324758 -0.0317574 0.0245812 0.0817573 1.4831402 -0.0030905 0.0758702 -0.331633 0.6328086 -0.0400632 -0.0971103 -0.21806 0.3147986 1.4851736 0.5252951 0.0607811 0.704947 0.641341 0.3032585 0.1441167 0.2485608 0.9362382 -0.4177382 -0.0590057 0.0856644 -0.0827354 -0.1740169 0.1302609 0.0433088 0.1208233 0.0378856 -0.0480757 0.1014187 -0.1013654 0.134137 -0.1936327 0.0666331 0.0035517 0.10824 0.0215973 0.0534583 -0.0056891 0.0301243 0.0108502 0.0132146 -0.0595742 0.010203 -0.0579912 -0.1628575 -0.0680644 -0.0288564 0.0130802 -0.1136223 -0.2415155 0.0143376 0.0420854 -0.0225153 0.042858 -0.051472 0.0012172 -0.0203239 -0.0139183 0.0408917 -0.0776778 0.0790207 -0.0339064 -0.1974377 -0.0841529 -0.094772 0.0641455 -0.0941373 0.088359 -0.0047897 0.0670926 0.0096709 0.0762935 -0.0311871 0.1264639 -0.10732 0.1045201 -0.0353438 0.0683523 -0.1016992 0.0876734 0.0135691 0.0927493 0.0085068 0.0311834 -0.0081008 0.0465906 -0.0195238 0.0331989 -0.0917013 -0.1615998 -0.090067 0.0863895 -0.0647153 0.1328338 0.0144824 0.0766732 -0.0912204 0.0705605 0.0336699 0.063962 -0.0520462 0.0127163 -0.1136935 -0.1803131 -0.0319198 0.0070256 -0.0366022 0.0832371 0.0739434 -0.0153459 -0.0198197 -0.004494 0.0802914 -0.0601212 0.0658962 -0.0380321 -0.1669467 0.059719 0.0329394 -0.020428 0.0832243 0.0617385 -0.0579084 -0.0228237 0.0284507 -0.0683216 -0.1392199 -0.1009399 -0.0065609 0.0247675 -0.2268632 0.0331483 -0.0484897 -0.0069826 0.0617978 0.2134094 -0.0720339 0.0277733 -0.1123753 0.311754 -0.0248645 0.0980358 -0.033415 0.1102785 0.0581421 -0.0673127 -0.0129236 -0.0464552 0.1070348 -0.1072505 0.0457803 -0.0833061 -0.0964888 -0.0121395 -0.0557333 0.0944587 -0.0583989 0.1400373 -0.0008277 0.1107208 0.0073084 0.0368175 0.1470587 -0.0178048 0.0248012 -0.024925 0.1500227 -0.0569434 -0.0047958 -0.0730972 0.0023626 unknown
polarizability: 143.3954902|17.9386184|85.0226463|-1.0453443|4.851309|85.8687245 unknown
InChI: InChI=1S/C8H15NO2/c1-4-8(10)9-6-11-5-7(2)3/h4,7,9H,1,5-6H2,2-3H3
charge 0 multiplicity 1
26 atoms
O  0.915516 0.436384 0.305012
O  -2.350185 -0.242581 -1.43962
N  -1.387763 0.958614 0.319981
C  3.253862 -0.242657 0.411798
C  2.232447 0.64455 -0.320056
C  2.914729 -1.740055 0.237656
C  4.682455 0.078904 -0.087186
C  -0.140919 1.216786 -0.360602
C  -2.404072 0.181018 -0.245591
C  -3.558973 -0.077287 0.674098
C  -4.629724 -0.804507 0.267334
H  3.18764 0.010445 1.489426
H  2.521823 1.717848 -0.242163
H  2.187974 0.372759 -1.399688
H  1.877118 -1.942314 0.552903
H  3.596307 -2.371399 0.837061
H  3.017448 -2.042056 -0.823013
H  5.42662 -0.544977 0.440288
H  4.947793 1.139749 0.081999
H  4.779718 -0.129846 -1.170264
H  -0.266029 0.904016 -1.415602
H  0.119331 2.297136 -0.310249
H  -1.453483 1.221781 1.304737
H  -3.512268 0.33525 1.691826
H  -5.478226 -1.007054 0.92901
H  -4.65454 -1.207909 -0.751797
